(view as text)
. ./oe-init-build-env; checkvnc; echo 'INHERIT += "testsdk"' >> ./conf/auto.conf;echo 'TEST_QEMUBOOT_TIMEOUT = "1500"' >> ./conf/auto.conf;DISPLAY=:1 bitbake -v core-image-minimal -c testsdkext
 in dir /home/pokybuild/yocto-autobuilder/yocto-worker/nightly-arm64/build (timeout 14800 secs)
 watching logfiles {}
 argv: . ./oe-init-build-env; checkvnc; echo 'INHERIT += "testsdk"' >> ./conf/auto.conf;echo 'TEST_QEMUBOOT_TIMEOUT = "1500"' >> ./conf/auto.conf;DISPLAY=:1 bitbake -v core-image-minimal -c testsdkext
 environment:
  ADTQA_INST_PUBLISH_DIR=adt-installer-QA
  ADTREPO_DEV_PATH=/srv/www/vhosts/adtrepo-dev/
  ADTREPO_DEV_POPULATE=True
  ADTREPO_DEV_URL=http://adtrepo-dev.yoctoproject.org/
  ADTREPO_GENERATE_DEV_INSTALLER=True
  ADTREPO_GENERATE_INSTALLER=False
  ADTREPO_PATH=/srv/www/vhosts/adtrepo.yoctoproject.org/
  ADTREPO_POPULATE=False
  ADTREPO_URL=http://adtrepo.yoctoproject.org/
  ADT_INST_PUBLISH_DIR=adt-installer
  BA_PUBLISH_DIR=build-appliance
  BB_NUMBER_THREADS=16
  BUILD_HISTORY_COLLECT=True
  BUILD_HISTORY_DIR=/srv/www/vhosts/autobuilder.yoctoproject.org/buildhistory
  BUILD_HISTORY_REPO=ssh://git@git.yoctoproject.org/poky-buildhistory
  BUILD_HISTORY_THROWAWAY_WHITELIST={'git://git.yoctoproject.org/poky':['master-next']}
  BUILD_HISTORY_WEB=True
  BUILD_HISTORY_WEB_DIR=/home/pokybuild/buildhistory-web
  BUILD_HISTORY_WHITELIST={'git://git.yoctoproject.org/poky':['master']}
  BUILD_PUBLISH_DIR=/srv/www/vhosts/autobuilder.yoctoproject.org/pub
  CLEAN_SOURCE_DIR=False
  CVS_RSH=ssh
  DEB_PUBLISH_DIR=deb
  DEVKERNEL=linux-yocto
  DEVKERNEL_MUT_REPO={'git://git.yoctoproject.org/poky-contrib':['stage/master_under_test', 'sgw/mut', 'ross/mut'], 'git://git.yoctoproject.org/poky':['ross/mut']}
  DL_DIR=/srv/www/vhosts/autobuilder.yoctoproject.org/current_sources
  EMGD_DRIVER_DIR=/tmp/yocto-autobuilder/emgd-driver
  ERROR_REPORT_COLLECT=True
  ERROR_REPORT_SUBMITTER_ID=production-yocto-autobuilder-fedora25
  GEN_IMG_MD5=True
  HISTCONTROL=ignoredups
  HISTSIZE=1000
  HOME=/home/pokybuild
  HOSTNAME=fedora25.osl.yoctoproject.org
  IMAGE_FSTYPES=tar.gz
  IPK_PUBLISH_DIR=ipk
  LANG=en_US.UTF-8
  LESSOPEN=||/usr/bin/lesspipe.sh %s
  LOGNAME=pokybuild
  LSB_SSTATE_DIR=/tmp/yocto-autobuilder/lsb-sstate
  LS_COLORS=rs=0:di=38;5;33:ln=38;5;51:mh=00:pi=40;38;5;11:so=38;5;13:do=38;5;5:bd=48;5;232;38;5;11:cd=48;5;232;38;5;3:or=48;5;232;38;5;9:mi=01;05;37;41:su=48;5;196;38;5;15:sg=48;5;11;38;5;16:ca=48;5;196;38;5;226:tw=48;5;10;38;5;16:ow=48;5;10;38;5;21:st=48;5;21;38;5;15:ex=38;5;40:*.tar=38;5;9:*.tgz=38;5;9:*.arc=38;5;9:*.arj=38;5;9:*.taz=38;5;9:*.lha=38;5;9:*.lz4=38;5;9:*.lzh=38;5;9:*.lzma=38;5;9:*.tlz=38;5;9:*.txz=38;5;9:*.tzo=38;5;9:*.t7z=38;5;9:*.zip=38;5;9:*.z=38;5;9:*.Z=38;5;9:*.dz=38;5;9:*.gz=38;5;9:*.lrz=38;5;9:*.lz=38;5;9:*.lzo=38;5;9:*.xz=38;5;9:*.bz2=38;5;9:*.bz=38;5;9:*.tbz=38;5;9:*.tbz2=38;5;9:*.tz=38;5;9:*.deb=38;5;9:*.rpm=38;5;9:*.jar=38;5;9:*.war=38;5;9:*.ear=38;5;9:*.sar=38;5;9:*.rar=38;5;9:*.alz=38;5;9:*.ace=38;5;9:*.zoo=38;5;9:*.cpio=38;5;9:*.7z=38;5;9:*.rz=38;5;9:*.cab=38;5;9:*.jpg=38;5;13:*.jpeg=38;5;13:*.gif=38;5;13:*.bmp=38;5;13:*.pbm=38;5;13:*.pgm=38;5;13:*.ppm=38;5;13:*.tga=38;5;13:*.xbm=38;5;13:*.xpm=38;5;13:*.tif=38;5;13:*.tiff=38;5;13:*.png=38;5;13:*.svg=38;5;13:*.svgz=38;5;13:*.mng=38;5;13:*.pcx=38;5;13:*.mov=38;5;13:*.mpg=38;5;13:*.mpeg=38;5;13:*.m2v=38;5;13:*.mkv=38;5;13:*.webm=38;5;13:*.ogm=38;5;13:*.mp4=38;5;13:*.m4v=38;5;13:*.mp4v=38;5;13:*.vob=38;5;13:*.qt=38;5;13:*.nuv=38;5;13:*.wmv=38;5;13:*.asf=38;5;13:*.rm=38;5;13:*.rmvb=38;5;13:*.flc=38;5;13:*.avi=38;5;13:*.fli=38;5;13:*.flv=38;5;13:*.gl=38;5;13:*.dl=38;5;13:*.xcf=38;5;13:*.xwd=38;5;13:*.yuv=38;5;13:*.cgm=38;5;13:*.emf=38;5;13:*.ogv=38;5;13:*.ogx=38;5;13:*.aac=38;5;45:*.au=38;5;45:*.flac=38;5;45:*.m4a=38;5;45:*.mid=38;5;45:*.midi=38;5;45:*.mka=38;5;45:*.mp3=38;5;45:*.mpc=38;5;45:*.ogg=38;5;45:*.ra=38;5;45:*.wav=38;5;45:*.oga=38;5;45:*.opus=38;5;45:*.spx=38;5;45:*.xspf=38;5;45:
  MACHINE_PUBLISH_DIR=machines
  MAIL=/var/spool/mail/pokybuild
  MAINTAIN_PERSISTDB=True
  MAKEFLAGS=
  MAKELEVEL=1
  MAKE_TERMERR=/dev/pts/1
  MAKE_TERMOUT=/dev/pts/1
  MARKED_RELEASE_DIR=releases
  MFLAGS=
  OGIT_MIRROR_DIR=/home/pokybuild/git/mirror
  OGIT_TRASH_CRON_TIME=0 0 * * *
  OGIT_TRASH_DIR=/home/pokybuild/git/trash
  OGIT_TRASH_NICE_LEVEL=19
  OLDPWD=/home/pokybuild
  OPTIMIZED_GIT_CLONE=True
  PARALLEL_MAKE_NUM=16
  PATH=/home/pokybuild/yocto-autobuilder/bin:/home/pokybuild/yocto-autobuilder/yocto-autobuilder/scripts:/usr/lib64/ccache:/usr/local/bin:/usr/bin:/usr/local/sbin:/usr/sbin:/home/pokybuild/.local/bin:/home/pokybuild/bin
  PERSISTDB_DIR=/srv/www/vhosts/autobuilder.yoctoproject.org/persistdb
  PRSERV_HOST=localhost
  PRSERV_PORT=0
  PUBLISH_BUILDS=True
  PUBLISH_SOURCE_MIRROR=True
  PUBLISH_SSTATE=False
  PWD=/home/pokybuild/yocto-autobuilder/yocto-worker/nightly-arm64/build
  PYTHONPATH=/home/pokybuild/yocto-autobuilder/lib/python2.7/site-packages/autobuilder/:/home/pokybuild/yocto-autobuilder/lib/python2.7/site-packages/:/home/pokybuild/yocto-autobuilder/lib/python2.7/site-packages/autobuilder/buildsteps:
  QA_MAIL_BCC=
  QA_MAIL_CC=pidge@toganlabs.com, jose.perez.carranza@intel.com, alexandru.c.georgescu@intel.com, otavio@ossystems.com.br, yi.zhao@windriver.com, tracy.graydon@intel.com, william.c.randle@intel.com
  QA_MAIL_SIG=\nThis is an automated message from\nThe Yocto Project Autobuilder\nGit: git://git.yoctoproject.org/yocto-autobuilder\nEmail: pidge@toganlabs.com
  QA_MAIL_TO=yocto@yoctoproject.org
  QEMU_PUBLISH_DIR=/machines/qemu
  RELEASE_PUBLISH_DIR=/srv/www/vhosts/autobuilder.yoctoproject.org/pub/releases
  RESOLVED_TRIGGERED_HEAD=True
  RESOLVE_TRIGGERED_HEAD=True
  RPM_PUBLISH_DIR=rpm
  SHELL=/bin/bash
  SHLVL=1
  SOURCE_DL_DIR=/srv/www/vhosts/autobuilder.yoctoproject.org/current_sources
  SOURCE_MIRROR_URL=/srv/www/vhosts/autobuilder.yoctoproject.org/pub/sources
  SOURCE_PUBLISH_DIR=/srv/www/vhosts/autobuilder.yoctoproject.org/current_sources
  SOURCE_SSTATE_DIR=/srv/www/vhosts/autobuilder.yoctoproject.org/pub/sstate
  SSTATE_DIR=/srv/www/vhosts/autobuilder.yoctoproject.org/pub/sstate
  SSTATE_PUBLISH_DIR=/srv/www/vhosts/autobuilder.yoctoproject.org/pub/sstate
  SSTATE_RELEASE_DIR=/srv/www/vhosts/downloads.yoctoproject.org/sstate
  TERM=xterm-256color
  TOASTER_UPLOAD_URL=http://toaster-ab-dev.yoctoproject.org/orm/eventfile
  USER=pokybuild
  WEB_ROOT=/srv/www/vhosts/autobuilder.yoctoproject.org/
  WEB_URL=http://autobuilder.yoctoproject.org/
  WORKERBASEDIR=/home/pokybuild/yocto-autobuilder/yocto-worker
  X8664TC_PUBLISH_DIR=toolchain/x86_64
  X86TC_PUBLISH_DIR=toolchain/i686
  YOCTO_AB_CONFIG=/home/pokybuild/yocto-autobuilder/buildset-config/yoctoAB.conf
  _=./yocto-start-autobuilder
 using PTY: False

### Shell environment set up for builds. ###

You can now run 'bitbake <target>'

Common targets are:
    core-image-minimal
    core-image-sato
    meta-toolchain
    meta-ide-support

You can also run generated qemu images with a command like 'runqemu qemux86'
NOTE: Starting bitbake server...
NOTE: Started PRServer with DBfile: /home/pokybuild/yocto-autobuilder/yocto-worker/nightly-arm64/build/build/cache/prserv.sqlite3, IP: 127.0.0.1, PORT: 46685, PID: 24837
Parsing recipes...done.
Parsing of 809 .bb files complete (0 cached, 809 parsed). 1258 targets, 64 skipped, 0 masked, 0 errors.
NOTE: Resolving any missing task queue dependencies
NOTE: selecting pseudo-native to satisfy virtual/fakeroot-native due to PREFERRED_PROVIDERS
NOTE: selecting opkg-utils-native to satisfy virtual/update-alternatives-native due to PREFERRED_PROVIDERS
NOTE: selecting opkg-native to satisfy opkg-native due to PREFERRED_PROVIDERS
NOTE: selecting linux-yocto to satisfy virtual/kernel due to PREFERRED_PROVIDERS
NOTE: selecting linux-yocto to satisfy runtime kernel-image-image due to PREFERRED_PROVIDER_virtual/kernel = linux-yocto
NOTE: selecting nativesdk-glibc to satisfy runtime nativesdk-glibc due to PREFERRED_PROVIDER_virtual/nativesdk-libc = nativesdk-glibc
NOTE: selecting linux-yocto to satisfy runtime kernel-base due to PREFERRED_PROVIDER_virtual/kernel = linux-yocto
NOTE: selecting glibc to satisfy virtual/libc due to PREFERRED_PROVIDERS
NOTE: selecting openssl-native to satisfy openssl-native due to PREFERRED_PROVIDERS
NOTE: selecting libgcc to satisfy libgcc due to PREFERRED_PROVIDERS
NOTE: selecting nativesdk-glibc to satisfy virtual/nativesdk-libc due to PREFERRED_PROVIDERS
NOTE: selecting gcc-cross-aarch64 to satisfy virtual/aarch64-poky-linux-gcc due to PREFERRED_PROVIDERS
NOTE: selecting nativesdk-glibc to satisfy virtual/nativesdk-libintl due to PREFERRED_PROVIDERS
NOTE: selecting binutils-crosssdk-x86_64-pokysdk-linux to satisfy virtual/x86_64-pokysdk-linux-binutils-crosssdk due to PREFERRED_PROVIDERS
NOTE: selecting nativesdk-openssl to satisfy nativesdk-openssl due to PREFERRED_PROVIDERS
NOTE: selecting nativesdk-linux-libc-headers to satisfy nativesdk-linux-libc-headers due to PREFERRED_PROVIDERS
NOTE: selecting nativesdk-glibc-initial to satisfy virtual/nativesdk-x86_64-pokysdk-linux-libc-initial due to PREFERRED_PROVIDERS
NOTE: selecting gcc-runtime to satisfy virtual/aarch64-poky-linux-compilerlibs due to PREFERRED_PROVIDERS
NOTE: selecting binutils-cross-aarch64 to satisfy virtual/aarch64-poky-linux-binutils due to PREFERRED_PROVIDERS
NOTE: selecting glibc-locale to satisfy runtime glibc-gconv-iso8859-15 due to PREFERRED_PROVIDER_virtual/libc-locale = glibc-locale
NOTE: selecting make to satisfy runtime make due to PREFERRED_PROVIDER_virtual/make = make
NOTE: selecting glibc to satisfy runtime glibc due to PREFERRED_PROVIDER_virtual/libc = glibc
NOTE: selecting nativesdk-openssl to satisfy runtime nativesdk-openssl-dev due to PREFERRED_PROVIDER_nativesdk-openssl = nativesdk-openssl
NOTE: selecting gcc-runtime to satisfy runtime libstdc++ due to PREFERRED_PROVIDER_virtual/aarch64-poky-linux-compilerlibs = gcc-runtime
NOTE: selecting gcc-runtime to satisfy runtime libatomic due to PREFERRED_PROVIDER_virtual/aarch64-poky-linux-compilerlibs = gcc-runtime
NOTE: selecting glibc to satisfy runtime glibc-utils due to PREFERRED_PROVIDER_virtual/libc = glibc
NOTE: selecting glibc-locale to satisfy runtime glibc-gconv-cp1252 due to PREFERRED_PROVIDER_virtual/libc-locale = glibc-locale
NOTE: selecting nativesdk-glibc to satisfy runtime nativesdk-glibc-dev due to PREFERRED_PROVIDER_virtual/nativesdk-libc = nativesdk-glibc
NOTE: selecting nativesdk-openssl to satisfy runtime nativesdk-openssl due to PREFERRED_PROVIDER_nativesdk-openssl = nativesdk-openssl
NOTE: selecting glibc to satisfy runtime glibc-dev due to PREFERRED_PROVIDER_virtual/libc = glibc
NOTE: selecting glibc-locale to satisfy runtime glibc-localedata-i18n due to PREFERRED_PROVIDER_virtual/libc-locale = glibc-locale
NOTE: selecting gcc-runtime to satisfy runtime libatomic-dev due to PREFERRED_PROVIDER_virtual/aarch64-poky-linux-compilerlibs = gcc-runtime
NOTE: selecting glibc to satisfy runtime libsegfault due to PREFERRED_PROVIDER_virtual/libc = glibc
NOTE: selecting libgcc to satisfy runtime libgcc due to PREFERRED_PROVIDER_libgcc = libgcc
NOTE: selecting eudev to satisfy runtime udev due to PREFERRED_PROVIDER_udev = eudev
NOTE: selecting openssl-native to satisfy runtime openssl-native due to PREFERRED_PROVIDER_openssl-native = openssl-native
NOTE: selecting glibc to satisfy runtime glibc-dbg due to PREFERRED_PROVIDER_virtual/libc = glibc
NOTE: selecting nativesdk-opkg to satisfy runtime nativesdk-opkg due to PREFERRED_PROVIDER_nativesdk-opkg = nativesdk-opkg
NOTE: selecting glibc-locale to satisfy runtime glibc-gconv-iso8859-1 due to PREFERRED_PROVIDER_virtual/libc-locale = glibc-locale
NOTE: selecting gcc-runtime to satisfy runtime libssp due to PREFERRED_PROVIDER_virtual/aarch64-poky-linux-compilerlibs = gcc-runtime
NOTE: selecting glibc-locale to satisfy runtime glibc-gconv-ibm850 due to PREFERRED_PROVIDER_virtual/libc-locale = glibc-locale
NOTE: selecting opkg-utils to satisfy runtime update-alternatives-opkg due to PREFERRED_PROVIDER_virtual/update-alternatives = opkg-utils
NOTE: selecting nativesdk-linux-libc-headers to satisfy runtime nativesdk-linux-libc-headers-dev due to PREFERRED_PROVIDER_nativesdk-linux-libc-headers = nativesdk-linux-libc-headers
NOTE: selecting nativesdk-glibc to satisfy runtime nativesdk-libsegfault due to PREFERRED_PROVIDER_virtual/nativesdk-libc = nativesdk-glibc
NOTE: selecting gcc-runtime to satisfy runtime libstdc++-dev due to PREFERRED_PROVIDER_virtual/aarch64-poky-linux-compilerlibs = gcc-runtime
NOTE: selecting glibc to satisfy runtime glibc-thread-db due to PREFERRED_PROVIDER_virtual/libc = glibc
NOTE: selecting libgcc to satisfy runtime libgcc-dev due to PREFERRED_PROVIDER_libgcc = libgcc
NOTE: selecting gcc-runtime to satisfy runtime libssp-dev due to PREFERRED_PROVIDER_virtual/aarch64-poky-linux-compilerlibs = gcc-runtime
NOTE: selecting gcc-cross-aarch64 to satisfy virtual/aarch64-poky-linux-g++ due to PREFERRED_PROVIDERS
NOTE: selecting nativesdk-glibc to satisfy virtual/nativesdk-libiconv due to PREFERRED_PROVIDERS
NOTE: selecting opkg-utils to satisfy virtual/update-alternatives due to PREFERRED_PROVIDERS
NOTE: selecting nativesdk-libgcc to satisfy nativesdk-libgcc due to PREFERRED_PROVIDERS
NOTE: selecting gettext to satisfy virtual/gettext due to PREFERRED_PROVIDERS
NOTE: selecting nativesdk-glibc to satisfy virtual/nativesdk-x86_64-pokysdk-linux-libc-for-gcc due to PREFERRED_PROVIDERS
NOTE: selecting glibc-initial to satisfy virtual/aarch64-poky-linux-libc-initial due to PREFERRED_PROVIDERS
NOTE: selecting gcc-cross-initial-aarch64 to satisfy virtual/aarch64-poky-linux-gcc-initial due to PREFERRED_PROVIDERS
NOTE: selecting glibc to satisfy virtual/aarch64-poky-linux-libc-for-gcc due to PREFERRED_PROVIDERS
NOTE: selecting linux-libc-headers to satisfy linux-libc-headers due to PREFERRED_PROVIDERS
NOTE: selecting db-native to satisfy virtual/db-native due to PREFERRED_PROVIDERS
NOTE: selecting glibc-locale to satisfy runtime glibc-gconv-cp1255 due to PREFERRED_PROVIDER_virtual/libc-locale = glibc-locale
NOTE: selecting glibc-locale to satisfy runtime glibc-gconv-utf-16 due to PREFERRED_PROVIDER_virtual/libc-locale = glibc-locale
NOTE: selecting glibc-locale to satisfy runtime glibc-charmap-cp1255 due to PREFERRED_PROVIDER_virtual/libc-locale = glibc-locale
NOTE: selecting eudev to satisfy runtime eudev due to PREFERRED_PROVIDER_udev = eudev
NOTE: selecting eudev to satisfy runtime eudev-dev due to PREFERRED_PROVIDER_udev = eudev
NOTE: selecting nativesdk-opkg to satisfy runtime nativesdk-opkg-dev due to PREFERRED_PROVIDER_nativesdk-opkg = nativesdk-opkg
NOTE: selecting glibc-locale to satisfy runtime glibc-gconv-euc-jp due to PREFERRED_PROVIDER_virtual/libc-locale = glibc-locale
NOTE: selecting make to satisfy runtime make-dev due to PREFERRED_PROVIDER_virtual/make = make
NOTE: selecting glibc-locale to satisfy runtime glibc-charmaps due to PREFERRED_PROVIDER_virtual/libc-locale = glibc-locale
NOTE: selecting nativesdk-libgcc to satisfy runtime nativesdk-libgcc due to PREFERRED_PROVIDER_nativesdk-libgcc = nativesdk-libgcc
NOTE: selecting glibc-locale to satisfy runtime glibc-localedata-translit-cjk-variants due to PREFERRED_PROVIDER_virtual/libc-locale = glibc-locale
NOTE: selecting glibc-locale to satisfy runtime glibc-gconvs due to PREFERRED_PROVIDER_virtual/libc-locale = glibc-locale
NOTE: selecting linux-libc-headers to satisfy runtime linux-libc-headers-dev due to PREFERRED_PROVIDER_linux-libc-headers = linux-libc-headers
NOTE: selecting glibc-locale to satisfy runtime glibc-charmap-invariant due to PREFERRED_PROVIDER_virtual/libc-locale = glibc-locale
NOTE: selecting glibc-locale to satisfy runtime glibc-gconv-utf-32 due to PREFERRED_PROVIDER_virtual/libc-locale = glibc-locale
NOTE: selecting glibc-locale to satisfy runtime glibc-gconv-utf-7 due to PREFERRED_PROVIDER_virtual/libc-locale = glibc-locale
NOTE: selecting glibc-locale to satisfy runtime glibc-charmap-utf-8 due to PREFERRED_PROVIDER_virtual/libc-locale = glibc-locale
NOTE: selecting gettext to satisfy runtime gettext due to PREFERRED_PROVIDER_virtual/gettext = gettext
NOTE: selecting gettext to satisfy runtime gettext-dev due to PREFERRED_PROVIDER_virtual/gettext = gettext
NOTE: selecting glibc-locale to satisfy runtime glibc-localedatas due to PREFERRED_PROVIDER_virtual/libc-locale = glibc-locale
NOTE: selecting db to satisfy virtual/db due to PREFERRED_PROVIDERS
NOTE: selecting openssl to satisfy openssl due to PREFERRED_PROVIDERS
NOTE: selecting glibc to satisfy virtual/libiconv due to PREFERRED_PROVIDERS
NOTE: selecting libx11 to satisfy virtual/libx11 due to PREFERRED_PROVIDERS
NOTE: selecting glibc to satisfy virtual/libintl due to PREFERRED_PROVIDERS
NOTE: selecting openssl to satisfy runtime openssl due to PREFERRED_PROVIDER_openssl = openssl
NOTE: selecting openssl to satisfy runtime openssl-dev due to PREFERRED_PROVIDER_openssl = openssl
NOTE: selecting glibc-locale to satisfy runtime glibc-gconv-ebcdic-us due to PREFERRED_PROVIDER_virtual/libc-locale = glibc-locale
NOTE: selecting libx11 to satisfy runtime libx11 due to PREFERRED_PROVIDER_virtual/libx11 = libx11
NOTE: selecting glibc-locale to satisfy runtime glibc-gconv-ibm1141 due to PREFERRED_PROVIDER_virtual/libc-locale = glibc-locale
NOTE: selecting db to satisfy runtime db due to PREFERRED_PROVIDER_virtual/db = db
NOTE: selecting libx11 to satisfy runtime libx11-dev due to PREFERRED_PROVIDER_virtual/libx11 = libx11
NOTE: selecting db to satisfy runtime db-dev due to PREFERRED_PROVIDER_virtual/db = db
NOTE: selecting glibc-locale to satisfy runtime locale-base-ru-ru due to PREFERRED_PROVIDER_virtual/libc-locale = glibc-locale

Build Configuration:
BB_VERSION        = "1.35.0"
BUILD_SYS         = "x86_64-linux"
NATIVELSBSTRING   = "universal"
TARGET_SYS        = "aarch64-poky-linux"
MACHINE           = "qemuarm64"
DISTRO            = "poky"
DISTRO_VERSION    = "2.3"
TUNE_FEATURES     = "aarch64"
TARGET_FPU        = ""
meta              
meta-poky         
meta-yocto-bsp    = "heads/ross/mut:b172aea5f2ed784160c402c392d564467ae860dc"

Initialising tasks...NOTE: Marking Active Tasks
NOTE: Pruned 10117 inactive tasks, 1 left
NOTE: Assign Weightings
NOTE: Compute totals (have 1 endpoint(s))
done.
NOTE: Executing RunQueue Tasks
NOTE: Running task 1 of 1 (/home/pokybuild/yocto-autobuilder/yocto-worker/nightly-arm64/build/meta/recipes-core/images/core-image-minimal.bb:do_testsdkext)
NOTE: recipe core-image-minimal-1.0-r0: task do_testsdkext: Started
Extensible SDK testing environment: aarch64-poky-linux
THREAD: 140178672842496
----------------------------------------------------------------------

Running tests...
----------------------------------------------------------------------

----------------------------------------------------------------------
Ran 0 tests in 0.000s

OK (skipped=1)

Generating XML reports...

THREAD: 140179028666112
----------------------------------------------------------------------

Running tests...
----------------------------------------------------------------------
  test_gcc_compile (gcc.GccCompileTest) ... OK (0.071s)
  test_gpp2_compile (gcc.GccCompileTest) ... OK (0.084s)
  test_gpp_compile (gcc.GccCompileTest) ... OK (0.122s)
  test_make (gcc.GccCompileTest) ... OK (0.074s)

----------------------------------------------------------------------
Ran 4 tests in 0.362s

OK

Generating XML reports...

THREAD: 140179020273408
----------------------------------------------------------------------

Running tests...
----------------------------------------------------------------------

----------------------------------------------------------------------
Ran 0 tests in 0.000s

OK (skipped=1)

Generating XML reports...

THREAD: 140179037058816
----------------------------------------------------------------------

Running tests...
----------------------------------------------------------------------
  test_lzip (buildlzip.BuildLzipTest) ... OK (5.316s)

----------------------------------------------------------------------
Ran 1 test in 5.518s

OK

Generating XML reports...

THREAD: 140179082086144
----------------------------------------------------------------------

Running tests...
----------------------------------------------------------------------
  test_cpio (buildcpio.BuildCpioTest) ... FAIL (220.154s)

======================================================================
FAIL [220.154s]: test_cpio (buildcpio.BuildCpioTest)
----------------------------------------------------------------------
Traceback (most recent call last):
  File "/home/pokybuild/yocto-autobuilder/yocto-worker/nightly-arm64/build/meta/lib/oeqa/sdk/cases/buildcpio.py", line 26, in test_cpio
    msg="Running make failed")
AssertionError: 2 != 0 : Running make failed

----------------------------------------------------------------------
Ran 1 test in 220.636s

FAILED (failures=1)

Generating XML reports...

THREAD: 140178664449792
----------------------------------------------------------------------

Running tests...
----------------------------------------------------------------------
  test_devtool_location (devtool.DevtoolTest) ... OK (0.009s)
  test_devtool_add_reset (devtool.DevtoolTest) ... ERROR (10.757s)
  test_devtool_build_cmake (devtool.DevtoolTest) ... ERROR (6.314s)
  test_devtool_build_esdk_package (devtool.DevtoolTest) ... ERROR (9.083s)
  test_devtool_build_make (devtool.DevtoolTest) ... ERROR (5.650s)
  test_devtool_kernelmodule (devtool.DevtoolTest) ... ERROR (160.588s)
  test_extend_autotools_recipe_creation (devtool.DevtoolTest) ... ERROR (81.197s)
  test_recipes_for_nodejs (devtool.DevtoolTest) ... OK (15.252s)
  test_sdk_update_http (devtool.SdkUpdateTest) ... OK (268.391s)

======================================================================
ERROR [10.757s]: test_devtool_add_reset (devtool.DevtoolTest)
----------------------------------------------------------------------
Traceback (most recent call last):
  File "/home/pokybuild/yocto-autobuilder/yocto-worker/nightly-arm64/build/meta/lib/oeqa/core/decorator/__init__.py", line 32, in wrapped_f
    return func(*args, **kwargs)
  File "/home/pokybuild/yocto-autobuilder/yocto-worker/nightly-arm64/build/meta/lib/oeqa/sdkext/cases/devtool.py", line 50, in test_devtool_add_reset
    self._run('devtool add myapp %s' % self.myapp_dst)
  File "/home/pokybuild/yocto-autobuilder/yocto-worker/nightly-arm64/build/meta/lib/oeqa/sdkext/case.py", line 21, in _run
    shell=True, env=env, universal_newlines=True)
  File "/usr/lib64/python3.5/subprocess.py", line 316, in check_output
    **kwargs).stdout
  File "/usr/lib64/python3.5/subprocess.py", line 398, in run
    output=stdout, stderr=stderr)
oeqa.utils.subprocesstweak.OETestCalledProcessError: Command '. /home/pokybuild/yocto-autobuilder/yocto-worker/nightly-arm64/build/build/tmp/work/qemuarm64-poky-linux/core-image-minimal/1.0-r0/testsdkext/environment-setup-aarch64-poky-linux > /dev/null; devtool add myapp /home/pokybuild/yocto-autobuilder/yocto-worker/nightly-arm64/build/build/tmp/work/qemuarm64-poky-linux/core-image-minimal/1.0-r0/testsdkext/myapp;' returned non-zero exit status 1
Standard Output: NOTE: Starting bitbake server...
NOTE: Starting bitbake server...
NOTE: Starting bitbake server...
ERROR: Traceback (most recent call last):
  File "/home/pokybuild/yocto-autobuilder/yocto-worker/nightly-arm64/build/build/tmp/work/qemuarm64-poky-linux/core-image-minimal/1.0-r0/testsdkext/layers/build/bitbake/lib/bb/command.py", line 83, in runCommand
    result = command_method(self, commandline)
  File "/home/pokybuild/yocto-autobuilder/yocto-worker/nightly-arm64/build/build/tmp/work/qemuarm64-poky-linux/core-image-minimal/1.0-r0/testsdkext/layers/build/bitbake/lib/bb/command.py", line 566, in parseRecipeFile
    envdata = parser.loadDataFull(fn, appendfiles)
  File "/home/pokybuild/yocto-autobuilder/yocto-worker/nightly-arm64/build/build/tmp/work/qemuarm64-poky-linux/core-image-minimal/1.0-r0/testsdkext/layers/build/bitbake/lib/bb/cache.py", line 339, in loadDataFull
    bb_data = self.load_bbfile(virtualfn, appends, virtonly=True)
  File "/home/pokybuild/yocto-autobuilder/yocto-worker/nightly-arm64/build/build/tmp/work/qemuarm64-poky-linux/core-image-minimal/1.0-r0/testsdkext/layers/build/bitbake/lib/bb/cache.py", line 352, in load_bbfile
    datastores = parse_recipe(bb_data, bbfile, appends, mc)
  File "/home/pokybuild/yocto-autobuilder/yocto-worker/nightly-arm64/build/build/tmp/work/qemuarm64-poky-linux/core-image-minimal/1.0-r0/testsdkext/layers/build/bitbake/lib/bb/cache.py", line 315, in parse_recipe
    bb_data = bb.parse.handle(bbfile, bb_data)
  File "/home/pokybuild/yocto-autobuilder/yocto-worker/nightly-arm64/build/build/tmp/work/qemuarm64-poky-linux/core-image-minimal/1.0-r0/testsdkext/layers/build/bitbake/lib/bb/parse/__init__.py", line 113, in handle
    return h['handle'](fn, data, include)
  File "/home/pokybuild/yocto-autobuilder/yocto-worker/nightly-arm64/build/build/tmp/work/qemuarm64-poky-linux/core-image-minimal/1.0-r0/testsdkext/layers/build/bitbake/lib/bb/parse/parse_py/BBHandler.py", line 157, in handle
    return ast.multi_finalize(fn, d)
  File "/home/pokybuild/yocto-autobuilder/yocto-worker/nightly-arm64/build/build/tmp/work/qemuarm64-poky-linux/core-image-minimal/1.0-r0/testsdkext/layers/build/bitbake/lib/bb/parse/ast.py", line 395, in multi_finalize
    finalize(fn, d)
  File "/home/pokybuild/yocto-autobuilder/yocto-worker/nightly-arm64/build/build/tmp/work/qemuarm64-poky-linux/core-image-minimal/1.0-r0/testsdkext/layers/build/bitbake/lib/bb/parse/ast.py", line 355, in finalize
    bb.utils.better_exec("\n".join(code), {"d": d})
  File "/home/pokybuild/yocto-autobuilder/yocto-worker/nightly-arm64/build/build/tmp/work/qemuarm64-poky-linux/core-image-minimal/1.0-r0/testsdkext/layers/build/bitbake/lib/bb/utils.py", line 399, in better_exec
    exec(code, get_context(), context)
  File "<code>", line 4, in <module>
  File "/home/pokybuild/yocto-autobuilder/yocto-worker/nightly-arm64/build/build/tmp/work/qemuarm64-poky-linux/core-image-minimal/1.0-r0/testsdkext/layers/build/meta/classes/base.bbclass", line 468, in __anon_686__home_pokybuild_yocto_autobuilder_yocto_worker_nightly_arm64_build_build_tmp_work_qemuarm64_poky_linux_core_image_minimal_1_0_r0_testsdkext_layers_build_meta_classes_base_bbclass
  File "/home/pokybuild/yocto-autobuilder/yocto-worker/nightly-arm64/build/build/tmp/work/qemuarm64-poky-linux/core-image-minimal/1.0-r0/testsdkext/layers/build/bitbake/lib/bb/__init__.py", line 104, in fatal
    raise BBHandledException()
bb.BBHandledException

ERROR: Parsing newly created recipe failed, moving recipe to /home/pokybuild/yocto-autobuilder/yocto-worker/nightly-arm64/build/build/tmp/work/qemuarm64-poky-linux/core-image-minimal/1.0-r0/testsdkext/workspace/recipes/myapp/myapp.bb.parsefailed for reference. If this looks to be caused by the recipe itself, please report this error.


======================================================================
ERROR [6.314s]: test_devtool_build_cmake (devtool.DevtoolTest)
----------------------------------------------------------------------
Traceback (most recent call last):
  File "/home/pokybuild/yocto-autobuilder/yocto-worker/nightly-arm64/build/meta/lib/oeqa/core/decorator/__init__.py", line 32, in wrapped_f
    return func(*args, **kwargs)
  File "/home/pokybuild/yocto-autobuilder/yocto-worker/nightly-arm64/build/meta/lib/oeqa/core/decorator/__init__.py", line 32, in wrapped_f
    return func(*args, **kwargs)
  File "/home/pokybuild/yocto-autobuilder/yocto-worker/nightly-arm64/build/meta/lib/oeqa/sdkext/cases/devtool.py", line 66, in test_devtool_build_cmake
    self._test_devtool_build(self.myapp_cmake_dst)
  File "/home/pokybuild/yocto-autobuilder/yocto-worker/nightly-arm64/build/meta/lib/oeqa/sdkext/cases/devtool.py", line 30, in _test_devtool_build
    self._run('devtool add myapp %s' % directory)
  File "/home/pokybuild/yocto-autobuilder/yocto-worker/nightly-arm64/build/meta/lib/oeqa/sdkext/case.py", line 21, in _run
    shell=True, env=env, universal_newlines=True)
  File "/usr/lib64/python3.5/subprocess.py", line 316, in check_output
    **kwargs).stdout
  File "/usr/lib64/python3.5/subprocess.py", line 398, in run
    output=stdout, stderr=stderr)
oeqa.utils.subprocesstweak.OETestCalledProcessError: Command '. /home/pokybuild/yocto-autobuilder/yocto-worker/nightly-arm64/build/build/tmp/work/qemuarm64-poky-linux/core-image-minimal/1.0-r0/testsdkext/environment-setup-aarch64-poky-linux > /dev/null; devtool add myapp /home/pokybuild/yocto-autobuilder/yocto-worker/nightly-arm64/build/build/tmp/work/qemuarm64-poky-linux/core-image-minimal/1.0-r0/testsdkext/myapp_cmake;' returned non-zero exit status 1
Standard Output: NOTE: Starting bitbake server...
NOTE: Starting bitbake server...
NOTE: Starting bitbake server...
ERROR: Traceback (most recent call last):
  File "/home/pokybuild/yocto-autobuilder/yocto-worker/nightly-arm64/build/build/tmp/work/qemuarm64-poky-linux/core-image-minimal/1.0-r0/testsdkext/layers/build/bitbake/lib/bb/command.py", line 83, in runCommand
    result = command_method(self, commandline)
  File "/home/pokybuild/yocto-autobuilder/yocto-worker/nightly-arm64/build/build/tmp/work/qemuarm64-poky-linux/core-image-minimal/1.0-r0/testsdkext/layers/build/bitbake/lib/bb/command.py", line 566, in parseRecipeFile
    envdata = parser.loadDataFull(fn, appendfiles)
  File "/home/pokybuild/yocto-autobuilder/yocto-worker/nightly-arm64/build/build/tmp/work/qemuarm64-poky-linux/core-image-minimal/1.0-r0/testsdkext/layers/build/bitbake/lib/bb/cache.py", line 339, in loadDataFull
    bb_data = self.load_bbfile(virtualfn, appends, virtonly=True)
  File "/home/pokybuild/yocto-autobuilder/yocto-worker/nightly-arm64/build/build/tmp/work/qemuarm64-poky-linux/core-image-minimal/1.0-r0/testsdkext/layers/build/bitbake/lib/bb/cache.py", line 352, in load_bbfile
    datastores = parse_recipe(bb_data, bbfile, appends, mc)
  File "/home/pokybuild/yocto-autobuilder/yocto-worker/nightly-arm64/build/build/tmp/work/qemuarm64-poky-linux/core-image-minimal/1.0-r0/testsdkext/layers/build/bitbake/lib/bb/cache.py", line 315, in parse_recipe
    bb_data = bb.parse.handle(bbfile, bb_data)
  File "/home/pokybuild/yocto-autobuilder/yocto-worker/nightly-arm64/build/build/tmp/work/qemuarm64-poky-linux/core-image-minimal/1.0-r0/testsdkext/layers/build/bitbake/lib/bb/parse/__init__.py", line 113, in handle
    return h['handle'](fn, data, include)
  File "/home/pokybuild/yocto-autobuilder/yocto-worker/nightly-arm64/build/build/tmp/work/qemuarm64-poky-linux/core-image-minimal/1.0-r0/testsdkext/layers/build/bitbake/lib/bb/parse/parse_py/BBHandler.py", line 157, in handle
    return ast.multi_finalize(fn, d)
  File "/home/pokybuild/yocto-autobuilder/yocto-worker/nightly-arm64/build/build/tmp/work/qemuarm64-poky-linux/core-image-minimal/1.0-r0/testsdkext/layers/build/bitbake/lib/bb/parse/ast.py", line 395, in multi_finalize
    finalize(fn, d)
  File "/home/pokybuild/yocto-autobuilder/yocto-worker/nightly-arm64/build/build/tmp/work/qemuarm64-poky-linux/core-image-minimal/1.0-r0/testsdkext/layers/build/bitbake/lib/bb/parse/ast.py", line 355, in finalize
    bb.utils.better_exec("\n".join(code), {"d": d})
  File "/home/pokybuild/yocto-autobuilder/yocto-worker/nightly-arm64/build/build/tmp/work/qemuarm64-poky-linux/core-image-minimal/1.0-r0/testsdkext/layers/build/bitbake/lib/bb/utils.py", line 399, in better_exec
    exec(code, get_context(), context)
  File "<code>", line 4, in <module>
  File "/home/pokybuild/yocto-autobuilder/yocto-worker/nightly-arm64/build/build/tmp/work/qemuarm64-poky-linux/core-image-minimal/1.0-r0/testsdkext/layers/build/meta/classes/base.bbclass", line 468, in __anon_686__home_pokybuild_yocto_autobuilder_yocto_worker_nightly_arm64_build_build_tmp_work_qemuarm64_poky_linux_core_image_minimal_1_0_r0_testsdkext_layers_build_meta_classes_base_bbclass
  File "/home/pokybuild/yocto-autobuilder/yocto-worker/nightly-arm64/build/build/tmp/work/qemuarm64-poky-linux/core-image-minimal/1.0-r0/testsdkext/layers/build/bitbake/lib/bb/__init__.py", line 104, in fatal
    raise BBHandledException()
bb.BBHandledException

ERROR: Parsing newly created recipe failed, moving recipe to /home/pokybuild/yocto-autobuilder/yocto-worker/nightly-arm64/build/build/tmp/work/qemuarm64-poky-linux/core-image-minimal/1.0-r0/testsdkext/workspace/recipes/myapp/myapp.bb.parsefailed for reference. If this looks to be caused by the recipe itself, please report this error.


======================================================================
ERROR [9.083s]: test_devtool_build_esdk_package (devtool.DevtoolTest)
----------------------------------------------------------------------
Traceback (most recent call last):
  File "/home/pokybuild/yocto-autobuilder/yocto-worker/nightly-arm64/build/meta/lib/oeqa/core/decorator/__init__.py", line 32, in wrapped_f
    return func(*args, **kwargs)
  File "/home/pokybuild/yocto-autobuilder/yocto-worker/nightly-arm64/build/meta/lib/oeqa/core/decorator/__init__.py", line 32, in wrapped_f
    return func(*args, **kwargs)
  File "/home/pokybuild/yocto-autobuilder/yocto-worker/nightly-arm64/build/meta/lib/oeqa/sdkext/cases/devtool.py", line 61, in test_devtool_build_esdk_package
    self._test_devtool_build_package(self.myapp_dst)
  File "/home/pokybuild/yocto-autobuilder/yocto-worker/nightly-arm64/build/meta/lib/oeqa/sdkext/cases/devtool.py", line 37, in _test_devtool_build_package
    self._run('devtool add myapp %s' % directory)
  File "/home/pokybuild/yocto-autobuilder/yocto-worker/nightly-arm64/build/meta/lib/oeqa/sdkext/case.py", line 21, in _run
    shell=True, env=env, universal_newlines=True)
  File "/usr/lib64/python3.5/subprocess.py", line 316, in check_output
    **kwargs).stdout
  File "/usr/lib64/python3.5/subprocess.py", line 398, in run
    output=stdout, stderr=stderr)
oeqa.utils.subprocesstweak.OETestCalledProcessError: Command '. /home/pokybuild/yocto-autobuilder/yocto-worker/nightly-arm64/build/build/tmp/work/qemuarm64-poky-linux/core-image-minimal/1.0-r0/testsdkext/environment-setup-aarch64-poky-linux > /dev/null; devtool add myapp /home/pokybuild/yocto-autobuilder/yocto-worker/nightly-arm64/build/build/tmp/work/qemuarm64-poky-linux/core-image-minimal/1.0-r0/testsdkext/myapp;' returned non-zero exit status 1
Standard Output: NOTE: Starting bitbake server...
NOTE: Starting bitbake server...
NOTE: Starting bitbake server...
ERROR: Traceback (most recent call last):
  File "/home/pokybuild/yocto-autobuilder/yocto-worker/nightly-arm64/build/build/tmp/work/qemuarm64-poky-linux/core-image-minimal/1.0-r0/testsdkext/layers/build/bitbake/lib/bb/command.py", line 83, in runCommand
    result = command_method(self, commandline)
  File "/home/pokybuild/yocto-autobuilder/yocto-worker/nightly-arm64/build/build/tmp/work/qemuarm64-poky-linux/core-image-minimal/1.0-r0/testsdkext/layers/build/bitbake/lib/bb/command.py", line 566, in parseRecipeFile
    envdata = parser.loadDataFull(fn, appendfiles)
  File "/home/pokybuild/yocto-autobuilder/yocto-worker/nightly-arm64/build/build/tmp/work/qemuarm64-poky-linux/core-image-minimal/1.0-r0/testsdkext/layers/build/bitbake/lib/bb/cache.py", line 339, in loadDataFull
    bb_data = self.load_bbfile(virtualfn, appends, virtonly=True)
  File "/home/pokybuild/yocto-autobuilder/yocto-worker/nightly-arm64/build/build/tmp/work/qemuarm64-poky-linux/core-image-minimal/1.0-r0/testsdkext/layers/build/bitbake/lib/bb/cache.py", line 352, in load_bbfile
    datastores = parse_recipe(bb_data, bbfile, appends, mc)
  File "/home/pokybuild/yocto-autobuilder/yocto-worker/nightly-arm64/build/build/tmp/work/qemuarm64-poky-linux/core-image-minimal/1.0-r0/testsdkext/layers/build/bitbake/lib/bb/cache.py", line 315, in parse_recipe
    bb_data = bb.parse.handle(bbfile, bb_data)
  File "/home/pokybuild/yocto-autobuilder/yocto-worker/nightly-arm64/build/build/tmp/work/qemuarm64-poky-linux/core-image-minimal/1.0-r0/testsdkext/layers/build/bitbake/lib/bb/parse/__init__.py", line 113, in handle
    return h['handle'](fn, data, include)
  File "/home/pokybuild/yocto-autobuilder/yocto-worker/nightly-arm64/build/build/tmp/work/qemuarm64-poky-linux/core-image-minimal/1.0-r0/testsdkext/layers/build/bitbake/lib/bb/parse/parse_py/BBHandler.py", line 157, in handle
    return ast.multi_finalize(fn, d)
  File "/home/pokybuild/yocto-autobuilder/yocto-worker/nightly-arm64/build/build/tmp/work/qemuarm64-poky-linux/core-image-minimal/1.0-r0/testsdkext/layers/build/bitbake/lib/bb/parse/ast.py", line 395, in multi_finalize
    finalize(fn, d)
  File "/home/pokybuild/yocto-autobuilder/yocto-worker/nightly-arm64/build/build/tmp/work/qemuarm64-poky-linux/core-image-minimal/1.0-r0/testsdkext/layers/build/bitbake/lib/bb/parse/ast.py", line 355, in finalize
    bb.utils.better_exec("\n".join(code), {"d": d})
  File "/home/pokybuild/yocto-autobuilder/yocto-worker/nightly-arm64/build/build/tmp/work/qemuarm64-poky-linux/core-image-minimal/1.0-r0/testsdkext/layers/build/bitbake/lib/bb/utils.py", line 399, in better_exec
    exec(code, get_context(), context)
  File "<code>", line 4, in <module>
  File "/home/pokybuild/yocto-autobuilder/yocto-worker/nightly-arm64/build/build/tmp/work/qemuarm64-poky-linux/core-image-minimal/1.0-r0/testsdkext/layers/build/meta/classes/base.bbclass", line 468, in __anon_686__home_pokybuild_yocto_autobuilder_yocto_worker_nightly_arm64_build_build_tmp_work_qemuarm64_poky_linux_core_image_minimal_1_0_r0_testsdkext_layers_build_meta_classes_base_bbclass
  File "/home/pokybuild/yocto-autobuilder/yocto-worker/nightly-arm64/build/build/tmp/work/qemuarm64-poky-linux/core-image-minimal/1.0-r0/testsdkext/layers/build/bitbake/lib/bb/__init__.py", line 104, in fatal
    raise BBHandledException()
bb.BBHandledException

ERROR: Parsing newly created recipe failed, moving recipe to /home/pokybuild/yocto-autobuilder/yocto-worker/nightly-arm64/build/build/tmp/work/qemuarm64-poky-linux/core-image-minimal/1.0-r0/testsdkext/workspace/recipes/myapp/myapp.bb.parsefailed for reference. If this looks to be caused by the recipe itself, please report this error.


======================================================================
ERROR [5.650s]: test_devtool_build_make (devtool.DevtoolTest)
----------------------------------------------------------------------
Traceback (most recent call last):
  File "/home/pokybuild/yocto-autobuilder/yocto-worker/nightly-arm64/build/meta/lib/oeqa/core/decorator/__init__.py", line 32, in wrapped_f
    return func(*args, **kwargs)
  File "/home/pokybuild/yocto-autobuilder/yocto-worker/nightly-arm64/build/meta/lib/oeqa/core/decorator/__init__.py", line 32, in wrapped_f
    return func(*args, **kwargs)
  File "/home/pokybuild/yocto-autobuilder/yocto-worker/nightly-arm64/build/meta/lib/oeqa/sdkext/cases/devtool.py", line 56, in test_devtool_build_make
    self._test_devtool_build(self.myapp_dst)
  File "/home/pokybuild/yocto-autobuilder/yocto-worker/nightly-arm64/build/meta/lib/oeqa/sdkext/cases/devtool.py", line 30, in _test_devtool_build
    self._run('devtool add myapp %s' % directory)
  File "/home/pokybuild/yocto-autobuilder/yocto-worker/nightly-arm64/build/meta/lib/oeqa/sdkext/case.py", line 21, in _run
    shell=True, env=env, universal_newlines=True)
  File "/usr/lib64/python3.5/subprocess.py", line 316, in check_output
    **kwargs).stdout
  File "/usr/lib64/python3.5/subprocess.py", line 398, in run
    output=stdout, stderr=stderr)
oeqa.utils.subprocesstweak.OETestCalledProcessError: Command '. /home/pokybuild/yocto-autobuilder/yocto-worker/nightly-arm64/build/build/tmp/work/qemuarm64-poky-linux/core-image-minimal/1.0-r0/testsdkext/environment-setup-aarch64-poky-linux > /dev/null; devtool add myapp /home/pokybuild/yocto-autobuilder/yocto-worker/nightly-arm64/build/build/tmp/work/qemuarm64-poky-linux/core-image-minimal/1.0-r0/testsdkext/myapp;' returned non-zero exit status 1
Standard Output: NOTE: Starting bitbake server...
NOTE: Starting bitbake server...
NOTE: Starting bitbake server...
ERROR: Traceback (most recent call last):
  File "/home/pokybuild/yocto-autobuilder/yocto-worker/nightly-arm64/build/build/tmp/work/qemuarm64-poky-linux/core-image-minimal/1.0-r0/testsdkext/layers/build/bitbake/lib/bb/command.py", line 83, in runCommand
    result = command_method(self, commandline)
  File "/home/pokybuild/yocto-autobuilder/yocto-worker/nightly-arm64/build/build/tmp/work/qemuarm64-poky-linux/core-image-minimal/1.0-r0/testsdkext/layers/build/bitbake/lib/bb/command.py", line 566, in parseRecipeFile
    envdata = parser.loadDataFull(fn, appendfiles)
  File "/home/pokybuild/yocto-autobuilder/yocto-worker/nightly-arm64/build/build/tmp/work/qemuarm64-poky-linux/core-image-minimal/1.0-r0/testsdkext/layers/build/bitbake/lib/bb/cache.py", line 339, in loadDataFull
    bb_data = self.load_bbfile(virtualfn, appends, virtonly=True)
  File "/home/pokybuild/yocto-autobuilder/yocto-worker/nightly-arm64/build/build/tmp/work/qemuarm64-poky-linux/core-image-minimal/1.0-r0/testsdkext/layers/build/bitbake/lib/bb/cache.py", line 352, in load_bbfile
    datastores = parse_recipe(bb_data, bbfile, appends, mc)
  File "/home/pokybuild/yocto-autobuilder/yocto-worker/nightly-arm64/build/build/tmp/work/qemuarm64-poky-linux/core-image-minimal/1.0-r0/testsdkext/layers/build/bitbake/lib/bb/cache.py", line 315, in parse_recipe
    bb_data = bb.parse.handle(bbfile, bb_data)
  File "/home/pokybuild/yocto-autobuilder/yocto-worker/nightly-arm64/build/build/tmp/work/qemuarm64-poky-linux/core-image-minimal/1.0-r0/testsdkext/layers/build/bitbake/lib/bb/parse/__init__.py", line 113, in handle
    return h['handle'](fn, data, include)
  File "/home/pokybuild/yocto-autobuilder/yocto-worker/nightly-arm64/build/build/tmp/work/qemuarm64-poky-linux/core-image-minimal/1.0-r0/testsdkext/layers/build/bitbake/lib/bb/parse/parse_py/BBHandler.py", line 157, in handle
    return ast.multi_finalize(fn, d)
  File "/home/pokybuild/yocto-autobuilder/yocto-worker/nightly-arm64/build/build/tmp/work/qemuarm64-poky-linux/core-image-minimal/1.0-r0/testsdkext/layers/build/bitbake/lib/bb/parse/ast.py", line 395, in multi_finalize
    finalize(fn, d)
  File "/home/pokybuild/yocto-autobuilder/yocto-worker/nightly-arm64/build/build/tmp/work/qemuarm64-poky-linux/core-image-minimal/1.0-r0/testsdkext/layers/build/bitbake/lib/bb/parse/ast.py", line 355, in finalize
    bb.utils.better_exec("\n".join(code), {"d": d})
  File "/home/pokybuild/yocto-autobuilder/yocto-worker/nightly-arm64/build/build/tmp/work/qemuarm64-poky-linux/core-image-minimal/1.0-r0/testsdkext/layers/build/bitbake/lib/bb/utils.py", line 399, in better_exec
    exec(code, get_context(), context)
  File "<code>", line 4, in <module>
  File "/home/pokybuild/yocto-autobuilder/yocto-worker/nightly-arm64/build/build/tmp/work/qemuarm64-poky-linux/core-image-minimal/1.0-r0/testsdkext/layers/build/meta/classes/base.bbclass", line 468, in __anon_686__home_pokybuild_yocto_autobuilder_yocto_worker_nightly_arm64_build_build_tmp_work_qemuarm64_poky_linux_core_image_minimal_1_0_r0_testsdkext_layers_build_meta_classes_base_bbclass
  File "/home/pokybuild/yocto-autobuilder/yocto-worker/nightly-arm64/build/build/tmp/work/qemuarm64-poky-linux/core-image-minimal/1.0-r0/testsdkext/layers/build/bitbake/lib/bb/__init__.py", line 104, in fatal
    raise BBHandledException()
bb.BBHandledException

ERROR: Parsing newly created recipe failed, moving recipe to /home/pokybuild/yocto-autobuilder/yocto-worker/nightly-arm64/build/build/tmp/work/qemuarm64-poky-linux/core-image-minimal/1.0-r0/testsdkext/workspace/recipes/myapp/myapp.bb.parsefailed for reference. If this looks to be caused by the recipe itself, please report this error.


======================================================================
ERROR [160.588s]: test_devtool_kernelmodule (devtool.DevtoolTest)
----------------------------------------------------------------------
Traceback (most recent call last):
  File "/home/pokybuild/yocto-autobuilder/yocto-worker/nightly-arm64/build/meta/lib/oeqa/core/decorator/__init__.py", line 32, in wrapped_f
    return func(*args, **kwargs)
  File "/home/pokybuild/yocto-autobuilder/yocto-worker/nightly-arm64/build/meta/lib/oeqa/core/decorator/__init__.py", line 32, in wrapped_f
    return func(*args, **kwargs)
  File "/home/pokybuild/yocto-autobuilder/yocto-worker/nightly-arm64/build/meta/lib/oeqa/sdkext/cases/devtool.py", line 85, in test_devtool_kernelmodule
    self._run('devtool add %s %s' % (recipe, docfile) )
  File "/home/pokybuild/yocto-autobuilder/yocto-worker/nightly-arm64/build/meta/lib/oeqa/sdkext/case.py", line 21, in _run
    shell=True, env=env, universal_newlines=True)
  File "/usr/lib64/python3.5/subprocess.py", line 316, in check_output
    **kwargs).stdout
  File "/usr/lib64/python3.5/subprocess.py", line 398, in run
    output=stdout, stderr=stderr)
oeqa.utils.subprocesstweak.OETestCalledProcessError: Command '. /home/pokybuild/yocto-autobuilder/yocto-worker/nightly-arm64/build/build/tmp/work/qemuarm64-poky-linux/core-image-minimal/1.0-r0/testsdkext/environment-setup-aarch64-poky-linux > /dev/null; devtool add v4l2loopback-driver https://github.com/umlaeute/v4l2loopback.git;' returned non-zero exit status 1
Standard Output: NOTE: Starting bitbake server...
NOTE: Starting bitbake server...
NOTE: Fetching git://github.com/umlaeute/v4l2loopback.git;protocol=https...
NOTE: Starting bitbake server...
Loading cache...done.
Loaded 1258 entries from dependency cache.
Parsing recipes...done.
Parsing of 810 .bb files complete (809 cached, 1 parsed). 1259 targets, 64 skipped, 0 masked, 0 errors.
NOTE: Resolving any missing task queue dependencies
Initialising tasks...done.
NOTE: Executing RunQueue Tasks
NOTE: Tasks Summary: Attempted 2 tasks of which 0 didn't need to be rerun and all succeeded.
NOTE: Using default source tree path /home/pokybuild/yocto-autobuilder/yocto-worker/nightly-arm64/build/build/tmp/work/qemuarm64-poky-linux/core-image-minimal/1.0-r0/testsdkext/workspace/sources/v4l2loopback-driver
NOTE: Starting bitbake server...
ERROR: Traceback (most recent call last):
  File "/home/pokybuild/yocto-autobuilder/yocto-worker/nightly-arm64/build/build/tmp/work/qemuarm64-poky-linux/core-image-minimal/1.0-r0/testsdkext/layers/build/bitbake/lib/bb/command.py", line 83, in runCommand
    result = command_method(self, commandline)
  File "/home/pokybuild/yocto-autobuilder/yocto-worker/nightly-arm64/build/build/tmp/work/qemuarm64-poky-linux/core-image-minimal/1.0-r0/testsdkext/layers/build/bitbake/lib/bb/command.py", line 566, in parseRecipeFile
    envdata = parser.loadDataFull(fn, appendfiles)
  File "/home/pokybuild/yocto-autobuilder/yocto-worker/nightly-arm64/build/build/tmp/work/qemuarm64-poky-linux/core-image-minimal/1.0-r0/testsdkext/layers/build/bitbake/lib/bb/cache.py", line 339, in loadDataFull
    bb_data = self.load_bbfile(virtualfn, appends, virtonly=True)
  File "/home/pokybuild/yocto-autobuilder/yocto-worker/nightly-arm64/build/build/tmp/work/qemuarm64-poky-linux/core-image-minimal/1.0-r0/testsdkext/layers/build/bitbake/lib/bb/cache.py", line 352, in load_bbfile
    datastores = parse_recipe(bb_data, bbfile, appends, mc)
  File "/home/pokybuild/yocto-autobuilder/yocto-worker/nightly-arm64/build/build/tmp/work/qemuarm64-poky-linux/core-image-minimal/1.0-r0/testsdkext/layers/build/bitbake/lib/bb/cache.py", line 315, in parse_recipe
    bb_data = bb.parse.handle(bbfile, bb_data)
  File "/home/pokybuild/yocto-autobuilder/yocto-worker/nightly-arm64/build/build/tmp/work/qemuarm64-poky-linux/core-image-minimal/1.0-r0/testsdkext/layers/build/bitbake/lib/bb/parse/__init__.py", line 113, in handle
    return h['handle'](fn, data, include)
  File "/home/pokybuild/yocto-autobuilder/yocto-worker/nightly-arm64/build/build/tmp/work/qemuarm64-poky-linux/core-image-minimal/1.0-r0/testsdkext/layers/build/bitbake/lib/bb/parse/parse_py/BBHandler.py", line 157, in handle
    return ast.multi_finalize(fn, d)
  File "/home/pokybuild/yocto-autobuilder/yocto-worker/nightly-arm64/build/build/tmp/work/qemuarm64-poky-linux/core-image-minimal/1.0-r0/testsdkext/layers/build/bitbake/lib/bb/parse/ast.py", line 395, in multi_finalize
    finalize(fn, d)
  File "/home/pokybuild/yocto-autobuilder/yocto-worker/nightly-arm64/build/build/tmp/work/qemuarm64-poky-linux/core-image-minimal/1.0-r0/testsdkext/layers/build/bitbake/lib/bb/parse/ast.py", line 355, in finalize
    bb.utils.better_exec("\n".join(code), {"d": d})
  File "/home/pokybuild/yocto-autobuilder/yocto-worker/nightly-arm64/build/build/tmp/work/qemuarm64-poky-linux/core-image-minimal/1.0-r0/testsdkext/layers/build/bitbake/lib/bb/utils.py", line 399, in better_exec
    exec(code, get_context(), context)
  File "<code>", line 4, in <module>
  File "/home/pokybuild/yocto-autobuilder/yocto-worker/nightly-arm64/build/build/tmp/work/qemuarm64-poky-linux/core-image-minimal/1.0-r0/testsdkext/layers/build/meta/classes/base.bbclass", line 468, in __anon_686__home_pokybuild_yocto_autobuilder_yocto_worker_nightly_arm64_build_build_tmp_work_qemuarm64_poky_linux_core_image_minimal_1_0_r0_testsdkext_layers_build_meta_classes_base_bbclass
  File "/home/pokybuild/yocto-autobuilder/yocto-worker/nightly-arm64/build/build/tmp/work/qemuarm64-poky-linux/core-image-minimal/1.0-r0/testsdkext/layers/build/bitbake/lib/bb/__init__.py", line 104, in fatal
    raise BBHandledException()
bb.BBHandledException

ERROR: Parsing newly created recipe failed, moving recipe to /home/pokybuild/yocto-autobuilder/yocto-worker/nightly-arm64/build/build/tmp/work/qemuarm64-poky-linux/core-image-minimal/1.0-r0/testsdkext/workspace/recipes/v4l2loopback-driver/v4l2loopback-driver_git.bb.parsefailed for reference. If this looks to be caused by the recipe itself, please report this error.


======================================================================
ERROR [81.197s]: test_extend_autotools_recipe_creation (devtool.DevtoolTest)
----------------------------------------------------------------------
Traceback (most recent call last):
  File "/home/pokybuild/yocto-autobuilder/yocto-worker/nightly-arm64/build/meta/lib/oeqa/core/decorator/__init__.py", line 32, in wrapped_f
    return func(*args, **kwargs)
  File "/home/pokybuild/yocto-autobuilder/yocto-worker/nightly-arm64/build/meta/lib/oeqa/core/decorator/__init__.py", line 32, in wrapped_f
    return func(*args, **kwargs)
  File "/home/pokybuild/yocto-autobuilder/yocto-worker/nightly-arm64/build/meta/lib/oeqa/sdkext/cases/devtool.py", line 74, in test_extend_autotools_recipe_creation
    self._run('devtool add %s %s' % (recipe, req) )
  File "/home/pokybuild/yocto-autobuilder/yocto-worker/nightly-arm64/build/meta/lib/oeqa/sdkext/case.py", line 21, in _run
    shell=True, env=env, universal_newlines=True)
  File "/usr/lib64/python3.5/subprocess.py", line 316, in check_output
    **kwargs).stdout
  File "/usr/lib64/python3.5/subprocess.py", line 398, in run
    output=stdout, stderr=stderr)
oeqa.utils.subprocesstweak.OETestCalledProcessError: Command '. /home/pokybuild/yocto-autobuilder/yocto-worker/nightly-arm64/build/build/tmp/work/qemuarm64-poky-linux/core-image-minimal/1.0-r0/testsdkext/environment-setup-aarch64-poky-linux > /dev/null; devtool add librdfa https://github.com/rdfa/librdfa;' returned non-zero exit status 1
Standard Output: NOTE: Starting bitbake server...
NOTE: Starting bitbake server...
NOTE: Fetching git://github.com/rdfa/librdfa;protocol=https...
NOTE: Starting bitbake server...
Loading cache...done.
Loaded 1258 entries from dependency cache.
Parsing recipes...done.
Parsing of 810 .bb files complete (809 cached, 1 parsed). 1259 targets, 64 skipped, 0 masked, 0 errors.
NOTE: Resolving any missing task queue dependencies
Initialising tasks...done.
NOTE: Executing RunQueue Tasks
NOTE: Tasks Summary: Attempted 2 tasks of which 0 didn't need to be rerun and all succeeded.
NOTE: Using default source tree path /home/pokybuild/yocto-autobuilder/yocto-worker/nightly-arm64/build/build/tmp/work/qemuarm64-poky-linux/core-image-minimal/1.0-r0/testsdkext/workspace/sources/librdfa
NOTE: Starting bitbake server...
ERROR: Traceback (most recent call last):
  File "/home/pokybuild/yocto-autobuilder/yocto-worker/nightly-arm64/build/build/tmp/work/qemuarm64-poky-linux/core-image-minimal/1.0-r0/testsdkext/layers/build/bitbake/lib/bb/command.py", line 83, in runCommand
    result = command_method(self, commandline)
  File "/home/pokybuild/yocto-autobuilder/yocto-worker/nightly-arm64/build/build/tmp/work/qemuarm64-poky-linux/core-image-minimal/1.0-r0/testsdkext/layers/build/bitbake/lib/bb/command.py", line 566, in parseRecipeFile
    envdata = parser.loadDataFull(fn, appendfiles)
  File "/home/pokybuild/yocto-autobuilder/yocto-worker/nightly-arm64/build/build/tmp/work/qemuarm64-poky-linux/core-image-minimal/1.0-r0/testsdkext/layers/build/bitbake/lib/bb/cache.py", line 339, in loadDataFull
    bb_data = self.load_bbfile(virtualfn, appends, virtonly=True)
  File "/home/pokybuild/yocto-autobuilder/yocto-worker/nightly-arm64/build/build/tmp/work/qemuarm64-poky-linux/core-image-minimal/1.0-r0/testsdkext/layers/build/bitbake/lib/bb/cache.py", line 352, in load_bbfile
    datastores = parse_recipe(bb_data, bbfile, appends, mc)
  File "/home/pokybuild/yocto-autobuilder/yocto-worker/nightly-arm64/build/build/tmp/work/qemuarm64-poky-linux/core-image-minimal/1.0-r0/testsdkext/layers/build/bitbake/lib/bb/cache.py", line 315, in parse_recipe
    bb_data = bb.parse.handle(bbfile, bb_data)
  File "/home/pokybuild/yocto-autobuilder/yocto-worker/nightly-arm64/build/build/tmp/work/qemuarm64-poky-linux/core-image-minimal/1.0-r0/testsdkext/layers/build/bitbake/lib/bb/parse/__init__.py", line 113, in handle
    return h['handle'](fn, data, include)
  File "/home/pokybuild/yocto-autobuilder/yocto-worker/nightly-arm64/build/build/tmp/work/qemuarm64-poky-linux/core-image-minimal/1.0-r0/testsdkext/layers/build/bitbake/lib/bb/parse/parse_py/BBHandler.py", line 157, in handle
    return ast.multi_finalize(fn, d)
  File "/home/pokybuild/yocto-autobuilder/yocto-worker/nightly-arm64/build/build/tmp/work/qemuarm64-poky-linux/core-image-minimal/1.0-r0/testsdkext/layers/build/bitbake/lib/bb/parse/ast.py", line 395, in multi_finalize
    finalize(fn, d)
  File "/home/pokybuild/yocto-autobuilder/yocto-worker/nightly-arm64/build/build/tmp/work/qemuarm64-poky-linux/core-image-minimal/1.0-r0/testsdkext/layers/build/bitbake/lib/bb/parse/ast.py", line 355, in finalize
    bb.utils.better_exec("\n".join(code), {"d": d})
  File "/home/pokybuild/yocto-autobuilder/yocto-worker/nightly-arm64/build/build/tmp/work/qemuarm64-poky-linux/core-image-minimal/1.0-r0/testsdkext/layers/build/bitbake/lib/bb/utils.py", line 399, in better_exec
    exec(code, get_context(), context)
  File "<code>", line 4, in <module>
  File "/home/pokybuild/yocto-autobuilder/yocto-worker/nightly-arm64/build/build/tmp/work/qemuarm64-poky-linux/core-image-minimal/1.0-r0/testsdkext/layers/build/meta/classes/base.bbclass", line 468, in __anon_686__home_pokybuild_yocto_autobuilder_yocto_worker_nightly_arm64_build_build_tmp_work_qemuarm64_poky_linux_core_image_minimal_1_0_r0_testsdkext_layers_build_meta_classes_base_bbclass
  File "/home/pokybuild/yocto-autobuilder/yocto-worker/nightly-arm64/build/build/tmp/work/qemuarm64-poky-linux/core-image-minimal/1.0-r0/testsdkext/layers/build/bitbake/lib/bb/__init__.py", line 104, in fatal
    raise BBHandledException()
bb.BBHandledException

ERROR: Parsing newly created recipe failed, moving recipe to /home/pokybuild/yocto-autobuilder/yocto-worker/nightly-arm64/build/build/tmp/work/qemuarm64-poky-linux/core-image-minimal/1.0-r0/testsdkext/workspace/recipes/librdfa/librdfa_git.bb.parsefailed for reference. If this looks to be caused by the recipe itself, please report this error.


----------------------------------------------------------------------
Ran 9 tests in 1042.919s

FAILED (errors=6)

Generating XML reports...

RESULTS:
RESULTS - buildcpio.BuildCpioTest.test_cpio - Testcase -1: FAILED
RESULTS - buildgalculator.GalculatorTest.test_galculator - Testcase -1: SKIPPED
RESULTS - buildlzip.BuildLzipTest.test_lzip - Testcase -1: PASSED
RESULTS - gcc.GccCompileTest.test_gcc_compile - Testcase -1: PASSED
RESULTS - gcc.GccCompileTest.test_gpp2_compile - Testcase -1: PASSED
RESULTS - gcc.GccCompileTest.test_gpp_compile - Testcase -1: PASSED
RESULTS - gcc.GccCompileTest.test_make - Testcase -1: PASSED
RESULTS - perl.PerlTest.test_perl_exists - Testcase -1: SKIPPED
RESULTS - perl.PerlTest.test_perl_works - Testcase -1: SKIPPED
RESULTS - python.PythonTest.test_python_exists - Testcase -1: SKIPPED
RESULTS - python.PythonTest.test_python_stdout - Testcase -1: SKIPPED
RESULTS - python.PythonTest.test_python_testfile - Testcase -1: SKIPPED
RESULTS - devtool.DevtoolTest.test_devtool_add_reset - Testcase -1: ERROR
RESULTS - devtool.DevtoolTest.test_devtool_build_cmake - Testcase 1607: ERROR
RESULTS - devtool.DevtoolTest.test_devtool_build_esdk_package - Testcase 1606: ERROR
RESULTS - devtool.DevtoolTest.test_devtool_build_make - Testcase 1605: ERROR
RESULTS - devtool.DevtoolTest.test_devtool_kernelmodule - Testcase 1609: ERROR
RESULTS - devtool.DevtoolTest.test_devtool_location - Testcase -1: PASSED
RESULTS - devtool.DevtoolTest.test_extend_autotools_recipe_creation - Testcase 1608: ERROR
RESULTS - devtool.DevtoolTest.test_recipes_for_nodejs - Testcase 1610: PASSED
RESULTS - devtool.SdkUpdateTest.test_sdk_update_http - Testcase -1: PASSED
SUMMARY:
core-image-minimal esdk (poky-glibc-x86_64-core-image-minimal-aarch64-toolchain-ext-2.3.sh:environment-setup-aarch64-poky-linux) - Ran 21 tests in 1042.970s
core-image-minimal esdk - FAIL - Required tests failed
ERROR: core-image-minimal-1.0-r0 do_testsdkext: core-image-minimal - FAILED - check the task log and the commands log
ERROR: core-image-minimal-1.0-r0 do_testsdkext: Function failed: do_testsdkext
ERROR: Logfile of failure stored in: /home/pokybuild/yocto-autobuilder/yocto-worker/nightly-arm64/build/build/tmp/work/qemuarm64-poky-linux/core-image-minimal/1.0-r0/temp/log.do_testsdkext.25001
NOTE: recipe core-image-minimal-1.0-r0: task do_testsdkext: Failed
ERROR: Task (/home/pokybuild/yocto-autobuilder/yocto-worker/nightly-arm64/build/meta/recipes-core/images/core-image-minimal.bb:do_testsdkext) failed with exit code '1'
NOTE: Tasks Summary: Attempted 1 tasks of which 0 didn't need to be rerun and 1 failed.
NOTE: The errors for this build are stored in /home/pokybuild/yocto-autobuilder/yocto-worker/nightly-arm64/build/build/tmp/log/error-report/error_report_20170810024910.txt
You can send the errors to a reports server by running:
  send-error-report /home/pokybuild/yocto-autobuilder/yocto-worker/nightly-arm64/build/build/tmp/log/error-report/error_report_20170810024910.txt [-s server]
NOTE: The contents of these logs will be posted in public if you use the above command with the default server. Please ensure you remove any identifying or proprietary information when prompted before sending.

Summary: 1 task failed:
  /home/pokybuild/yocto-autobuilder/yocto-worker/nightly-arm64/build/meta/recipes-core/images/core-image-minimal.bb:do_testsdkext
Summary: There were 2 ERROR messages shown, returning a non-zero exit code.
program finished with exit code 1
elapsedTime=1537.326126