(view as text)
. ./oe-init-build-env; checkvnc; echo 'INHERIT += "testsdk"' >> ./conf/auto.conf;echo 'TEST_QEMUBOOT_TIMEOUT = "1500"' >> ./conf/auto.conf;DISPLAY=:1 bitbake -v core-image-minimal core-image-sato -c testsdkext
 in dir /home/pokybuild/yocto-autobuilder/yocto-worker/nightly-mips/build (timeout 14800 secs)
 watching logfiles {}
 argv: . ./oe-init-build-env; checkvnc; echo 'INHERIT += "testsdk"' >> ./conf/auto.conf;echo 'TEST_QEMUBOOT_TIMEOUT = "1500"' >> ./conf/auto.conf;DISPLAY=:1 bitbake -v core-image-minimal core-image-sato -c testsdkext
 environment:
  ADTQA_INST_PUBLISH_DIR=adt-installer-QA
  ADTREPO_DEV_PATH=/srv/www/vhosts/adtrepo-dev/
  ADTREPO_DEV_POPULATE=True
  ADTREPO_DEV_URL=http://adtrepo-dev.yoctoproject.org/
  ADTREPO_GENERATE_DEV_INSTALLER=True
  ADTREPO_GENERATE_INSTALLER=False
  ADTREPO_PATH=/srv/www/vhosts/adtrepo.yoctoproject.org/
  ADTREPO_POPULATE=False
  ADTREPO_URL=http://adtrepo.yoctoproject.org/
  ADT_INST_PUBLISH_DIR=adt-installer
  BA_PUBLISH_DIR=build-appliance
  BB_NUMBER_THREADS=16
  BUILD_HISTORY_COLLECT=True
  BUILD_HISTORY_DIR=/srv/www/vhosts/autobuilder.yoctoproject.org/buildhistory
  BUILD_HISTORY_REPO=ssh://git@git.yoctoproject.org/poky-buildhistory
  BUILD_HISTORY_THROWAWAY_WHITELIST={'git://git.yoctoproject.org/poky':['master-next']}
  BUILD_HISTORY_WEB=True
  BUILD_HISTORY_WEB_DIR=/home/pokybuild/buildhistory-web
  BUILD_HISTORY_WHITELIST={'git://git.yoctoproject.org/poky':['master']}
  BUILD_PUBLISH_DIR=/srv/www/vhosts/autobuilder.yoctoproject.org/pub
  CLEAN_SOURCE_DIR=False
  DEB_PUBLISH_DIR=deb
  DEVKERNEL=linux-yocto
  DEVKERNEL_MUT_REPO={'git://git.yoctoproject.org/poky-contrib':['stage/master_under_test', 'sgw/mut', 'ross/mut'], 'git://git.yoctoproject.org/poky':['ross/mut']}
  DL_DIR=/srv/www/vhosts/autobuilder.yoctoproject.org/current_sources
  EMGD_DRIVER_DIR=/tmp/yocto-autobuilder/emgd-driver
  ERROR_REPORT_COLLECT=True
  ERROR_REPORT_SUBMITTER_ID=production-yocto-autobuilder-ubuntu1604
  GEN_IMG_MD5=True
  HOME=/home/pokybuild
  IMAGE_FSTYPES=tar.gz
  IPK_PUBLISH_DIR=ipk
  LANG=en_US.UTF-8
  LESSCLOSE=/usr/bin/lesspipe %s %s
  LESSOPEN=| /usr/bin/lesspipe %s
  LOGNAME=pokybuild
  LSB_SSTATE_DIR=/tmp/yocto-autobuilder/lsb-sstate
  LS_COLORS=rs=0:di=01;34:ln=01;36:mh=00:pi=40;33:so=01;35:do=01;35:bd=40;33;01:cd=40;33;01:or=40;31;01:mi=00:su=37;41:sg=30;43:ca=30;41:tw=30;42:ow=34;42:st=37;44:ex=01;32:*.tar=01;31:*.tgz=01;31:*.arc=01;31:*.arj=01;31:*.taz=01;31:*.lha=01;31:*.lz4=01;31:*.lzh=01;31:*.lzma=01;31:*.tlz=01;31:*.txz=01;31:*.tzo=01;31:*.t7z=01;31:*.zip=01;31:*.z=01;31:*.Z=01;31:*.dz=01;31:*.gz=01;31:*.lrz=01;31:*.lz=01;31:*.lzo=01;31:*.xz=01;31:*.bz2=01;31:*.bz=01;31:*.tbz=01;31:*.tbz2=01;31:*.tz=01;31:*.deb=01;31:*.rpm=01;31:*.jar=01;31:*.war=01;31:*.ear=01;31:*.sar=01;31:*.rar=01;31:*.alz=01;31:*.ace=01;31:*.zoo=01;31:*.cpio=01;31:*.7z=01;31:*.rz=01;31:*.cab=01;31:*.jpg=01;35:*.jpeg=01;35:*.gif=01;35:*.bmp=01;35:*.pbm=01;35:*.pgm=01;35:*.ppm=01;35:*.tga=01;35:*.xbm=01;35:*.xpm=01;35:*.tif=01;35:*.tiff=01;35:*.png=01;35:*.svg=01;35:*.svgz=01;35:*.mng=01;35:*.pcx=01;35:*.mov=01;35:*.mpg=01;35:*.mpeg=01;35:*.m2v=01;35:*.mkv=01;35:*.webm=01;35:*.ogm=01;35:*.mp4=01;35:*.m4v=01;35:*.mp4v=01;35:*.vob=01;35:*.qt=01;35:*.nuv=01;35:*.wmv=01;35:*.asf=01;35:*.rm=01;35:*.rmvb=01;35:*.flc=01;35:*.avi=01;35:*.fli=01;35:*.flv=01;35:*.gl=01;35:*.dl=01;35:*.xcf=01;35:*.xwd=01;35:*.yuv=01;35:*.cgm=01;35:*.emf=01;35:*.ogv=01;35:*.ogx=01;35:*.aac=00;36:*.au=00;36:*.flac=00;36:*.m4a=00;36:*.mid=00;36:*.midi=00;36:*.mka=00;36:*.mp3=00;36:*.mpc=00;36:*.ogg=00;36:*.ra=00;36:*.wav=00;36:*.oga=00;36:*.opus=00;36:*.spx=00;36:*.xspf=00;36:
  MACHINE_PUBLISH_DIR=machines
  MAIL=/var/mail/pokybuild
  MAINTAIN_PERSISTDB=True
  MAKEFLAGS=
  MAKELEVEL=1
  MAKE_TERMERR=/dev/pts/1
  MAKE_TERMOUT=/dev/pts/1
  MARKED_RELEASE_DIR=releases
  MFLAGS=
  OGIT_MIRROR_DIR=/home/pokybuild/git/mirror
  OGIT_TRASH_CRON_TIME=0 0 * * *
  OGIT_TRASH_DIR=/home/pokybuild/git/trash
  OGIT_TRASH_NICE_LEVEL=19
  OLDPWD=/home/pokybuild
  OPTIMIZED_GIT_CLONE=True
  PARALLEL_MAKE_NUM=16
  PATH=/home/pokybuild/yocto-autobuilder/bin:/home/pokybuild/yocto-autobuilder/yocto-autobuilder/scripts:/home/pokybuild/bin:/home/pokybuild/.local/bin:/usr/local/bin:/usr/bin:/bin:/usr/local/games:/usr/games:/snap/bin
  PERSISTDB_DIR=/srv/www/vhosts/autobuilder.yoctoproject.org/persistdb
  PRSERV_HOST=localhost
  PRSERV_PORT=0
  PUBLISH_BUILDS=True
  PUBLISH_SOURCE_MIRROR=True
  PUBLISH_SSTATE=False
  PWD=/home/pokybuild/yocto-autobuilder/yocto-worker/nightly-mips/build
  PYTHONPATH=/home/pokybuild/yocto-autobuilder/lib/python2.7/site-packages/autobuilder/:/home/pokybuild/yocto-autobuilder/lib/python2.7/site-packages/:/home/pokybuild/yocto-autobuilder/lib/python2.7/site-packages/autobuilder/buildsteps:
  QA_MAIL_BCC=
  QA_MAIL_CC=pidge@toganlabs.com, jose.perez.carranza@intel.com, alexandru.c.georgescu@intel.com, otavio@ossystems.com.br, yi.zhao@windriver.com, tracy.graydon@intel.com, william.c.randle@intel.com
  QA_MAIL_SIG=\nThis is an automated message from\nThe Yocto Project Autobuilder\nGit: git://git.yoctoproject.org/yocto-autobuilder\nEmail: pidge@toganlabs.com
  QA_MAIL_TO=yocto@yoctoproject.org
  QEMU_PUBLISH_DIR=/machines/qemu
  RELEASE_PUBLISH_DIR=/srv/www/vhosts/autobuilder.yoctoproject.org/pub/releases
  RESOLVED_TRIGGERED_HEAD=True
  RESOLVE_TRIGGERED_HEAD=True
  RPM_PUBLISH_DIR=rpm
  SHELL=/bin/bash
  SHLVL=1
  SOURCE_DL_DIR=/srv/www/vhosts/autobuilder.yoctoproject.org/current_sources
  SOURCE_MIRROR_URL=/srv/www/vhosts/autobuilder.yoctoproject.org/pub/sources
  SOURCE_PUBLISH_DIR=/srv/www/vhosts/autobuilder.yoctoproject.org/current_sources
  SOURCE_SSTATE_DIR=/srv/www/vhosts/autobuilder.yoctoproject.org/pub/sstate
  SSTATE_DIR=/srv/www/vhosts/autobuilder.yoctoproject.org/pub/sstate
  SSTATE_PUBLISH_DIR=/srv/www/vhosts/autobuilder.yoctoproject.org/pub/sstate
  SSTATE_RELEASE_DIR=/srv/www/vhosts/downloads.yoctoproject.org/sstate
  TERM=xterm-256color
  TOASTER_UPLOAD_URL=http://toaster-ab-dev.yoctoproject.org/orm/eventfile
  USER=pokybuild
  WEB_ROOT=/srv/www/vhosts/autobuilder.yoctoproject.org/
  WEB_URL=http://autobuilder.yoctoproject.org/
  WORKERBASEDIR=/home/pokybuild/yocto-autobuilder/yocto-worker
  X8664TC_PUBLISH_DIR=toolchain/x86_64
  X86TC_PUBLISH_DIR=toolchain/i686
  YOCTO_AB_CONFIG=/home/pokybuild/yocto-autobuilder/buildset-config/yoctoAB.conf
  _=./yocto-start-autobuilder
 using PTY: False

### Shell environment set up for builds. ###

You can now run 'bitbake <target>'

Common targets are:
    core-image-minimal
    core-image-sato
    meta-toolchain
    meta-ide-support

You can also run generated qemu images with a command like 'runqemu qemux86'
NOTE: Starting bitbake server...
NOTE: Started PRServer with DBfile: /home/pokybuild/yocto-autobuilder/yocto-worker/nightly-mips/build/build/cache/prserv.sqlite3, IP: 127.0.0.1, PORT: 42565, PID: 9454
Parsing recipes...done.
Parsing of 809 .bb files complete (0 cached, 809 parsed). 1258 targets, 69 skipped, 0 masked, 0 errors.
NOTE: Resolving any missing task queue dependencies
NOTE: selecting pseudo-native to satisfy virtual/fakeroot-native due to PREFERRED_PROVIDERS
NOTE: selecting opkg-utils-native to satisfy virtual/update-alternatives-native due to PREFERRED_PROVIDERS
NOTE: selecting linux-yocto to satisfy virtual/kernel due to PREFERRED_PROVIDERS
NOTE: selecting opkg-native to satisfy opkg-native due to PREFERRED_PROVIDERS
NOTE: selecting linux-yocto to satisfy runtime kernel-image-vmlinux.bin due to PREFERRED_PROVIDER_virtual/kernel = linux-yocto
NOTE: selecting linux-yocto to satisfy runtime kernel-image-vmlinux due to PREFERRED_PROVIDER_virtual/kernel = linux-yocto
NOTE: selecting glibc-locale to satisfy runtime locale-base-en-gb due to PREFERRED_PROVIDER_virtual/libc-locale = glibc-locale
NOTE: selecting linux-yocto to satisfy runtime kernel-vmlinux due to PREFERRED_PROVIDER_virtual/kernel = linux-yocto
NOTE: selecting nativesdk-glibc to satisfy runtime nativesdk-glibc due to PREFERRED_PROVIDER_virtual/nativesdk-libc = nativesdk-glibc
NOTE: selecting linux-yocto to satisfy runtime kernel-base due to PREFERRED_PROVIDER_virtual/kernel = linux-yocto
NOTE: selecting glibc-locale to satisfy runtime locale-base-en-us due to PREFERRED_PROVIDER_virtual/libc-locale = glibc-locale
NOTE: selecting openssl-native to satisfy openssl-native due to PREFERRED_PROVIDERS
NOTE: selecting nativesdk-glibc to satisfy virtual/nativesdk-libc due to PREFERRED_PROVIDERS
NOTE: selecting opkg-utils to satisfy virtual/update-alternatives due to PREFERRED_PROVIDERS
NOTE: selecting nativesdk-glibc to satisfy virtual/nativesdk-libintl due to PREFERRED_PROVIDERS
NOTE: selecting nativesdk-openssl to satisfy nativesdk-openssl due to PREFERRED_PROVIDERS
NOTE: selecting gcc-runtime to satisfy virtual/mips-poky-linux-compilerlibs due to PREFERRED_PROVIDERS
NOTE: selecting binutils-cross-mips to satisfy virtual/mips-poky-linux-binutils due to PREFERRED_PROVIDERS
NOTE: selecting binutils-crosssdk-x86_64-pokysdk-linux to satisfy virtual/x86_64-pokysdk-linux-binutils-crosssdk due to PREFERRED_PROVIDERS
NOTE: selecting nativesdk-linux-libc-headers to satisfy nativesdk-linux-libc-headers due to PREFERRED_PROVIDERS
NOTE: selecting glibc to satisfy virtual/libc due to PREFERRED_PROVIDERS
NOTE: selecting gettext to satisfy virtual/gettext due to PREFERRED_PROVIDERS
NOTE: selecting gcc-cross-mips to satisfy virtual/mips-poky-linux-gcc due to PREFERRED_PROVIDERS
NOTE: selecting nativesdk-glibc-initial to satisfy virtual/nativesdk-x86_64-pokysdk-linux-libc-initial due to PREFERRED_PROVIDERS
NOTE: selecting gcc-runtime to satisfy runtime libstdc++ due to PREFERRED_PROVIDER_virtual/mips-poky-linux-compilerlibs = gcc-runtime
NOTE: selecting linux-yocto to satisfy runtime kernel-module-michael-mic due to PREFERRED_PROVIDER_virtual/kernel = linux-yocto
NOTE: selecting linux-yocto to satisfy runtime kernel-module-ieee80211-crypt due to PREFERRED_PROVIDER_virtual/kernel = linux-yocto
NOTE: selecting linux-yocto to satisfy runtime kernel-module-nfs due to PREFERRED_PROVIDER_virtual/kernel = linux-yocto
NOTE: selecting linux-yocto to satisfy runtime kernel-module-bluetooth due to PREFERRED_PROVIDER_virtual/kernel = linux-yocto
NOTE: selecting libgcc to satisfy runtime libgcc due to PREFERRED_PROVIDER_libgcc = libgcc
NOTE: selecting nativesdk-opkg to satisfy runtime nativesdk-opkg due to PREFERRED_PROVIDER_nativesdk-opkg = nativesdk-opkg
NOTE: selecting gcc-runtime to satisfy runtime libssp-dev due to PREFERRED_PROVIDER_virtual/mips-poky-linux-compilerlibs = gcc-runtime
NOTE: selecting linux-yocto to satisfy runtime kernel-module-cdc-acm due to PREFERRED_PROVIDER_virtual/kernel = linux-yocto
NOTE: selecting linux-yocto to satisfy runtime kernel-module-snd-mixer-oss due to PREFERRED_PROVIDER_virtual/kernel = linux-yocto
NOTE: selecting linux-yocto to satisfy runtime kernel-module-g-serial due to PREFERRED_PROVIDER_virtual/kernel = linux-yocto
NOTE: selecting linux-yocto to satisfy runtime kernel-module-l2cap due to PREFERRED_PROVIDER_virtual/kernel = linux-yocto
NOTE: selecting nativesdk-openssl to satisfy runtime nativesdk-openssl due to PREFERRED_PROVIDER_nativesdk-openssl = nativesdk-openssl
NOTE: selecting nativesdk-openssl to satisfy runtime nativesdk-openssl-dev due to PREFERRED_PROVIDER_nativesdk-openssl = nativesdk-openssl
NOTE: selecting linux-yocto to satisfy runtime kernel-module-cdc-wdm due to PREFERRED_PROVIDER_virtual/kernel = linux-yocto
NOTE: selecting linux-yocto to satisfy runtime kernel-module-gadgetfs due to PREFERRED_PROVIDER_virtual/kernel = linux-yocto
NOTE: selecting linux-yocto to satisfy runtime kernel-module-pxa27x_udc due to PREFERRED_PROVIDER_virtual/kernel = linux-yocto
NOTE: selecting glibc-locale to satisfy runtime glibc-gconv-ibm850 due to PREFERRED_PROVIDER_virtual/libc-locale = glibc-locale
NOTE: selecting openssl-native to satisfy runtime openssl-native due to PREFERRED_PROVIDER_openssl-native = openssl-native
NOTE: selecting linux-yocto to satisfy runtime kernel-modules due to PREFERRED_PROVIDER_virtual/kernel = linux-yocto
NOTE: selecting linux-yocto to satisfy runtime kernel-module-ipv6 due to PREFERRED_PROVIDER_virtual/kernel = linux-yocto
NOTE: selecting linux-yocto to satisfy runtime kernel-module-nls-utf8 due to PREFERRED_PROVIDER_virtual/kernel = linux-yocto
NOTE: selecting openssl to satisfy runtime openssl due to PREFERRED_PROVIDER_openssl = openssl
NOTE: selecting linux-yocto to satisfy runtime kernel-module-nfc due to PREFERRED_PROVIDER_virtual/kernel = linux-yocto
NOTE: selecting glibc-locale to satisfy runtime glibc-gconv-iso8859-15 due to PREFERRED_PROVIDER_virtual/libc-locale = glibc-locale
NOTE: selecting glibc to satisfy runtime glibc-thread-db due to PREFERRED_PROVIDER_virtual/libc = glibc
NOTE: selecting linux-yocto to satisfy runtime kernel-module-rtc-dev due to PREFERRED_PROVIDER_virtual/kernel = linux-yocto
NOTE: selecting glibc-locale to satisfy runtime glibc-gconv-iso8859-1 due to PREFERRED_PROVIDER_virtual/libc-locale = glibc-locale
NOTE: selecting linux-yocto to satisfy runtime kernel-module-rtc-proc due to PREFERRED_PROVIDER_virtual/kernel = linux-yocto
NOTE: selecting glibc to satisfy runtime glibc-utils due to PREFERRED_PROVIDER_virtual/libc = glibc
NOTE: selecting linux-yocto to satisfy runtime kernel-module-g-file-storage due to PREFERRED_PROVIDER_virtual/kernel = linux-yocto
NOTE: selecting linux-yocto to satisfy runtime kernel-module-arc4 due to PREFERRED_PROVIDER_virtual/kernel = linux-yocto
NOTE: selecting linux-yocto to satisfy runtime kernel-module-input due to PREFERRED_PROVIDER_virtual/kernel = linux-yocto
NOTE: selecting glibc to satisfy runtime glibc-dev due to PREFERRED_PROVIDER_virtual/libc = glibc
NOTE: selecting db to satisfy runtime db due to PREFERRED_PROVIDER_virtual/db = db
NOTE: selecting glibc to satisfy runtime libsegfault due to PREFERRED_PROVIDER_virtual/libc = glibc
NOTE: selecting linux-yocto to satisfy runtime kernel-module-ecb due to PREFERRED_PROVIDER_virtual/kernel = linux-yocto
NOTE: selecting linux-yocto to satisfy runtime kernel-module-crypto_algapi due to PREFERRED_PROVIDER_virtual/kernel = linux-yocto
NOTE: selecting linux-yocto to satisfy runtime kernel-module-cryptomgr due to PREFERRED_PROVIDER_virtual/kernel = linux-yocto
NOTE: selecting gcc-runtime to satisfy runtime libstdc++-dev due to PREFERRED_PROVIDER_virtual/mips-poky-linux-compilerlibs = gcc-runtime
NOTE: selecting make to satisfy runtime make due to PREFERRED_PROVIDER_virtual/make = make
NOTE: selecting linux-yocto to satisfy runtime kernel-module-aes due to PREFERRED_PROVIDER_virtual/kernel = linux-yocto
NOTE: selecting nativesdk-glibc to satisfy runtime nativesdk-glibc-dev due to PREFERRED_PROVIDER_virtual/nativesdk-libc = nativesdk-glibc
NOTE: selecting glibc-locale to satisfy runtime glibc-gconvs due to PREFERRED_PROVIDER_virtual/libc-locale = glibc-locale
NOTE: selecting linux-yocto to satisfy runtime kernel-module-hidp due to PREFERRED_PROVIDER_virtual/kernel = linux-yocto
NOTE: selecting linux-yocto to satisfy runtime kernel-module-snd-pcm-oss due to PREFERRED_PROVIDER_virtual/kernel = linux-yocto
NOTE: selecting glibc-locale to satisfy runtime glibc-localedata-i18n due to PREFERRED_PROVIDER_virtual/libc-locale = glibc-locale
NOTE: selecting gcc-runtime to satisfy runtime libssp due to PREFERRED_PROVIDER_virtual/mips-poky-linux-compilerlibs = gcc-runtime
NOTE: selecting linux-yocto to satisfy runtime kernel-module-ieee80211-crypt-ccmp due to PREFERRED_PROVIDER_virtual/kernel = linux-yocto
NOTE: selecting glibc to satisfy runtime glibc due to PREFERRED_PROVIDER_virtual/libc = glibc
NOTE: selecting eudev to satisfy runtime udev due to PREFERRED_PROVIDER_udev = eudev
NOTE: selecting linux-yocto to satisfy runtime kernel-module-hci-uart due to PREFERRED_PROVIDER_virtual/kernel = linux-yocto
NOTE: selecting linux-yocto to satisfy runtime kernel-module-uinput due to PREFERRED_PROVIDER_virtual/kernel = linux-yocto
NOTE: selecting db to satisfy runtime db-dev due to PREFERRED_PROVIDER_virtual/db = db
NOTE: selecting linux-yocto to satisfy runtime kernel-module-bnep due to PREFERRED_PROVIDER_virtual/kernel = linux-yocto
NOTE: selecting libgcc to satisfy runtime libgcc-dev due to PREFERRED_PROVIDER_libgcc = libgcc
NOTE: selecting glibc-locale to satisfy runtime glibc-gconv-cp1252 due to PREFERRED_PROVIDER_virtual/libc-locale = glibc-locale
NOTE: selecting linux-yocto to satisfy runtime kernel-module-af-packet due to PREFERRED_PROVIDER_virtual/kernel = linux-yocto
NOTE: selecting nativesdk-linux-libc-headers to satisfy runtime nativesdk-linux-libc-headers-dev due to PREFERRED_PROVIDER_nativesdk-linux-libc-headers = nativesdk-linux-libc-headers
NOTE: selecting glibc-locale to satisfy runtime glibc-localedatas due to PREFERRED_PROVIDER_virtual/libc-locale = glibc-locale
NOTE: selecting linux-yocto to satisfy runtime kernel-module-ieee80211-crypt-tkip due to PREFERRED_PROVIDER_virtual/kernel = linux-yocto
NOTE: selecting nativesdk-glibc to satisfy runtime nativesdk-libsegfault due to PREFERRED_PROVIDER_virtual/nativesdk-libc = nativesdk-glibc
NOTE: selecting gcc-runtime to satisfy runtime libatomic-dev due to PREFERRED_PROVIDER_virtual/mips-poky-linux-compilerlibs = gcc-runtime
NOTE: selecting gettext to satisfy runtime gettext-dev due to PREFERRED_PROVIDER_virtual/gettext = gettext
NOTE: selecting linux-yocto to satisfy runtime kernel-module-aes-generic due to PREFERRED_PROVIDER_virtual/kernel = linux-yocto
NOTE: selecting linux-yocto to satisfy runtime kernel-module-rfcomm due to PREFERRED_PROVIDER_virtual/kernel = linux-yocto
NOTE: selecting glibc-locale to satisfy runtime glibc-charmaps due to PREFERRED_PROVIDER_virtual/libc-locale = glibc-locale
NOTE: selecting gettext to satisfy runtime gettext due to PREFERRED_PROVIDER_virtual/gettext = gettext
NOTE: selecting linux-yocto to satisfy runtime kernel-module-ieee80211-crypt-wep due to PREFERRED_PROVIDER_virtual/kernel = linux-yocto
NOTE: selecting linux-yocto to satisfy runtime kernel-module-g-ether due to PREFERRED_PROVIDER_virtual/kernel = linux-yocto
NOTE: selecting linux-yocto to satisfy runtime kernel-module-rtc-sysfs due to PREFERRED_PROVIDER_virtual/kernel = linux-yocto
NOTE: selecting glibc to satisfy runtime glibc-dbg due to PREFERRED_PROVIDER_virtual/libc = glibc
NOTE: selecting opkg-utils to satisfy runtime update-alternatives-opkg due to PREFERRED_PROVIDER_virtual/update-alternatives = opkg-utils
NOTE: selecting linux-yocto to satisfy runtime kernel-module-hci-vhci due to PREFERRED_PROVIDER_virtual/kernel = linux-yocto
NOTE: selecting gcc-runtime to satisfy runtime libatomic due to PREFERRED_PROVIDER_virtual/mips-poky-linux-compilerlibs = gcc-runtime
NOTE: selecting linux-yocto to satisfy runtime kernel-module-sco due to PREFERRED_PROVIDER_virtual/kernel = linux-yocto
NOTE: selecting linux-yocto to satisfy runtime kernel-module-unix due to PREFERRED_PROVIDER_virtual/kernel = linux-yocto
NOTE: selecting glibc-initial to satisfy virtual/mips-poky-linux-libc-initial due to PREFERRED_PROVIDERS
NOTE: selecting dbus-glib-native to satisfy dbus-glib-native due to PREFERRED_PROVIDERS
NOTE: selecting glibc to satisfy virtual/libiconv due to PREFERRED_PROVIDERS
NOTE: selecting mesa to satisfy virtual/libgl due to PREFERRED_PROVIDERS
NOTE: selecting glibc to satisfy virtual/mips-poky-linux-libc-for-gcc due to PREFERRED_PROVIDERS
NOTE: selecting eudev to satisfy udev due to PREFERRED_PROVIDERS
NOTE: selecting libgcc to satisfy libgcc due to PREFERRED_PROVIDERS
NOTE: selecting openssl to satisfy openssl due to PREFERRED_PROVIDERS
NOTE: selecting nativesdk-glibc to satisfy virtual/nativesdk-x86_64-pokysdk-linux-libc-for-gcc due to PREFERRED_PROVIDERS
NOTE: selecting gcc-cross-initial-mips to satisfy virtual/mips-poky-linux-gcc-initial due to PREFERRED_PROVIDERS
NOTE: selecting linux-libc-headers to satisfy linux-libc-headers due to PREFERRED_PROVIDERS
NOTE: selecting nativesdk-libgcc to satisfy nativesdk-libgcc due to PREFERRED_PROVIDERS
NOTE: selecting nativesdk-glibc to satisfy virtual/nativesdk-libiconv due to PREFERRED_PROVIDERS
NOTE: selecting gcc-cross-mips to satisfy virtual/mips-poky-linux-g++ due to PREFERRED_PROVIDERS
NOTE: selecting libx11 to satisfy virtual/libx11 due to PREFERRED_PROVIDERS
NOTE: selecting glibc to satisfy virtual/libintl due to PREFERRED_PROVIDERS
NOTE: selecting dbus-glib to satisfy dbus-glib due to PREFERRED_PROVIDERS
NOTE: selecting db to satisfy virtual/db due to PREFERRED_PROVIDERS
NOTE: selecting db-native to satisfy virtual/db-native due to PREFERRED_PROVIDERS
NOTE: selecting glibc-locale to satisfy runtime glibc-gconv-euc-jp due to PREFERRED_PROVIDER_virtual/libc-locale = glibc-locale
NOTE: selecting dbus-glib to satisfy runtime dbus-glib-dev due to PREFERRED_PROVIDER_dbus-glib = dbus-glib
NOTE: selecting mesa to satisfy runtime libgles3-mesa-dev due to PREFERRED_PROVIDER_virtual/libgl = mesa
NOTE: selecting glibc-locale to satisfy runtime glibc-gconv-ibm1141 due to PREFERRED_PROVIDER_virtual/libc-locale = glibc-locale
NOTE: selecting glibc-locale to satisfy runtime glibc-gconv-utf-16 due to PREFERRED_PROVIDER_virtual/libc-locale = glibc-locale
NOTE: selecting linux-yocto to satisfy runtime kernel-module-tun due to PREFERRED_PROVIDER_virtual/kernel = linux-yocto
NOTE: selecting libx11 to satisfy runtime libx11-dev due to PREFERRED_PROVIDER_virtual/libx11 = libx11
NOTE: selecting glibc-locale to satisfy runtime glibc-charmap-utf-8 due to PREFERRED_PROVIDER_virtual/libc-locale = glibc-locale
NOTE: selecting nativesdk-libgcc to satisfy runtime nativesdk-libgcc due to PREFERRED_PROVIDER_nativesdk-libgcc = nativesdk-libgcc
NOTE: selecting mesa to satisfy runtime mesa-megadriver due to PREFERRED_PROVIDER_virtual/libgl = mesa
NOTE: selecting xserver-xorg to satisfy runtime xserver-xorg-extension-glx due to PREFERRED_PROVIDER_virtual/xserver-xf86 = xserver-xorg
NOTE: selecting xserver-xorg to satisfy runtime xserver-xorg due to PREFERRED_PROVIDER_virtual/xserver-xf86 = xserver-xorg
NOTE: selecting glibc-locale to satisfy runtime glibc-charmap-invariant due to PREFERRED_PROVIDER_virtual/libc-locale = glibc-locale
NOTE: selecting eudev to satisfy runtime eudev due to PREFERRED_PROVIDER_udev = eudev
NOTE: selecting gdk-pixbuf to satisfy runtime gdk-pixbuf-loader-jpeg due to PREFERRED_PROVIDER_gdk-pixbuf = gdk-pixbuf
NOTE: selecting gdk-pixbuf to satisfy runtime gdk-pixbuf-loader-png due to PREFERRED_PROVIDER_gdk-pixbuf = gdk-pixbuf
NOTE: selecting libx11 to satisfy runtime libx11 due to PREFERRED_PROVIDER_virtual/libx11 = libx11
NOTE: selecting glibc-locale to satisfy runtime glibc-gconv-cp1255 due to PREFERRED_PROVIDER_virtual/libc-locale = glibc-locale
NOTE: selecting glibc-locale to satisfy runtime glibc-gconv-ebcdic-us due to PREFERRED_PROVIDER_virtual/libc-locale = glibc-locale
NOTE: selecting linux-libc-headers to satisfy runtime linux-libc-headers-dev due to PREFERRED_PROVIDER_linux-libc-headers = linux-libc-headers
NOTE: selecting glibc-locale to satisfy runtime glibc-gconv-utf-32 due to PREFERRED_PROVIDER_virtual/libc-locale = glibc-locale
NOTE: selecting nativesdk-opkg to satisfy runtime nativesdk-opkg-dev due to PREFERRED_PROVIDER_nativesdk-opkg = nativesdk-opkg
NOTE: selecting openssl to satisfy runtime openssl-dev due to PREFERRED_PROVIDER_openssl = openssl
NOTE: selecting mesa to satisfy runtime libgl due to PREFERRED_PROVIDER_virtual/libgl = mesa
NOTE: selecting mesa to satisfy runtime mesa-driver-swrast due to PREFERRED_PROVIDER_virtual/libgl = mesa
NOTE: selecting gdk-pixbuf to satisfy runtime gdk-pixbuf-loader-gif due to PREFERRED_PROVIDER_gdk-pixbuf = gdk-pixbuf
NOTE: selecting glibc-locale to satisfy runtime glibc-localedata-translit-cjk-variants due to PREFERRED_PROVIDER_virtual/libc-locale = glibc-locale
NOTE: selecting dbus-glib to satisfy runtime dbus-glib due to PREFERRED_PROVIDER_dbus-glib = dbus-glib
NOTE: selecting glibc-locale to satisfy runtime glibc-charmap-cp1255 due to PREFERRED_PROVIDER_virtual/libc-locale = glibc-locale
NOTE: selecting mesa to satisfy runtime mesa-dev due to PREFERRED_PROVIDER_virtual/libgl = mesa
NOTE: selecting glibc-locale to satisfy runtime glibc-gconv-utf-7 due to PREFERRED_PROVIDER_virtual/libc-locale = glibc-locale
NOTE: selecting gdk-pixbuf to satisfy runtime gdk-pixbuf-loader-xpm due to PREFERRED_PROVIDER_gdk-pixbuf = gdk-pixbuf
NOTE: selecting eudev to satisfy runtime eudev-dev due to PREFERRED_PROVIDER_udev = eudev
NOTE: selecting make to satisfy runtime make-dev due to PREFERRED_PROVIDER_virtual/make = make
NOTE: selecting mesa to satisfy virtual/mesa due to PREFERRED_PROVIDERS
NOTE: selecting xserver-xorg to satisfy virtual/xserver due to PREFERRED_PROVIDERS
NOTE: selecting mesa to satisfy virtual/egl due to PREFERRED_PROVIDERS
NOTE: selecting gdk-pixbuf to satisfy gdk-pixbuf due to PREFERRED_PROVIDERS
NOTE: selecting mesa to satisfy virtual/libgles2 due to PREFERRED_PROVIDERS
NOTE: selecting linux-yocto to satisfy runtime kernel-module-nf-nat due to PREFERRED_PROVIDER_virtual/kernel = linux-yocto
NOTE: selecting linux-yocto to satisfy runtime kernel-module-nf-defrag-ipv4 due to PREFERRED_PROVIDER_virtual/kernel = linux-yocto
NOTE: selecting gdk-pixbuf to satisfy runtime gdk-pixbuf-dev due to PREFERRED_PROVIDER_gdk-pixbuf = gdk-pixbuf
NOTE: selecting mesa to satisfy runtime libegl due to PREFERRED_PROVIDER_virtual/libgl = mesa
NOTE: selecting linux-yocto to satisfy runtime kernel-module-nf-conntrack-ipv4 due to PREFERRED_PROVIDER_virtual/kernel = linux-yocto
NOTE: selecting linux-yocto to satisfy runtime kernel-module-iptable-nat due to PREFERRED_PROVIDER_virtual/kernel = linux-yocto
NOTE: selecting linux-yocto to satisfy runtime kernel-module-x-tables due to PREFERRED_PROVIDER_virtual/kernel = linux-yocto
NOTE: selecting linux-yocto to satisfy runtime kernel-module-nf-conntrack due to PREFERRED_PROVIDER_virtual/kernel = linux-yocto
NOTE: selecting glibc-locale to satisfy runtime locale-base-ru-ru due to PREFERRED_PROVIDER_virtual/libc-locale = glibc-locale
NOTE: selecting linux-yocto to satisfy runtime kernel-module-ip-tables due to PREFERRED_PROVIDER_virtual/kernel = linux-yocto
NOTE: selecting gdk-pixbuf to satisfy runtime gdk-pixbuf due to PREFERRED_PROVIDER_gdk-pixbuf = gdk-pixbuf
NOTE: selecting xserver-xorg to satisfy runtime xserver-xorg-dev due to PREFERRED_PROVIDER_virtual/xserver-xf86 = xserver-xorg
NOTE: selecting linux-yocto to satisfy runtime kernel-module-iptable-filter due to PREFERRED_PROVIDER_virtual/kernel = linux-yocto
NOTE: selecting linux-yocto to satisfy runtime kernel-module-ipt-masquerade due to PREFERRED_PROVIDER_virtual/kernel = linux-yocto
NOTE: selecting linux-yocto to satisfy runtime kernel-module-nfsd due to PREFERRED_PROVIDER_virtual/kernel = linux-yocto

Build Configuration:
BB_VERSION        = "1.35.0"
BUILD_SYS         = "x86_64-linux"
NATIVELSBSTRING   = "universal"
TARGET_SYS        = "mips-poky-linux"
MACHINE           = "qemumips"
DISTRO            = "poky"
DISTRO_VERSION    = "2.3"
TUNE_FEATURES     = "o32 bigendian fpu-hard mips32r2"
TARGET_FPU        = ""
meta              
meta-poky         
meta-yocto-bsp    = "heads/ross/mut:b172aea5f2ed784160c402c392d564467ae860dc"

Initialising tasks...NOTE: Marking Active Tasks
NOTE: Pruned 19161 inactive tasks, 2 left
NOTE: Assign Weightings
NOTE: Compute totals (have 2 endpoint(s))
done.
NOTE: Executing RunQueue Tasks
NOTE: Running task 1 of 2 (/home/pokybuild/yocto-autobuilder/yocto-worker/nightly-mips/build/meta/recipes-core/images/core-image-minimal.bb:do_testsdkext)
NOTE: Running task 2 of 2 (/home/pokybuild/yocto-autobuilder/yocto-worker/nightly-mips/build/meta/recipes-sato/images/core-image-sato.bb:do_testsdkext)
NOTE: recipe core-image-minimal-1.0-r0: task do_testsdkext: Started
NOTE: recipe core-image-sato-1.0-r0: task do_testsdkext: Started
Extensible SDK testing environment: mips32r2-poky-linux
Extensible SDK testing environment: mips32r2-poky-linux
THREAD: 140529366841088
----------------------------------------------------------------------

Running tests...
----------------------------------------------------------------------

----------------------------------------------------------------------
Ran 0 tests in 0.000s

OK (skipped=1)

Generating XML reports...

THREAD: 140529333270272
----------------------------------------------------------------------

Running tests...
----------------------------------------------------------------------

----------------------------------------------------------------------
Ran 0 tests in 0.000s

OK (skipped=1)

Generating XML reports...

THREAD: 140529341662976
----------------------------------------------------------------------

Running tests...
----------------------------------------------------------------------

----------------------------------------------------------------------
Ran 0 tests in 0.000s

OK (skipped=1)

Generating XML reports...

THREAD: 140529341662976
----------------------------------------------------------------------

Running tests...
----------------------------------------------------------------------

----------------------------------------------------------------------
Ran 0 tests in 0.000s

OK (skipped=1)

Generating XML reports...

THREAD: 140529333270272
----------------------------------------------------------------------

Running tests...
----------------------------------------------------------------------

----------------------------------------------------------------------
Ran 0 tests in 0.000s

OK (skipped=1)

Generating XML reports...

THREAD: 140529350055680
----------------------------------------------------------------------

Running tests...
----------------------------------------------------------------------
  test_gcc_compile (gcc.GccCompileTest) ... OK (0.201s)
  test_gpp2_compile (gcc.GccCompileTest) ... OK (0.109s)
  test_gpp_compile (gcc.GccCompileTest) ... OK (0.347s)
  test_make (gcc.GccCompileTest) ... OK (0.118s)

THREAD: 140529350055680
----------------------------------------------------------------------
----------------------------------------------------------------------
Ran 4 tests in 0.833s


Running tests...
OK
----------------------------------------------------------------------

  test_gcc_compile (gcc.GccCompileTest) ... OK (0.084s)
Generating XML reports...
  test_gpp2_compile (gcc.GccCompileTest) ... OK (0.120s)

  test_gpp_compile (gcc.GccCompileTest) ... OK (0.294s)
  test_make (gcc.GccCompileTest) ... OK (0.119s)

----------------------------------------------------------------------
Ran 4 tests in 0.625s

OK

Generating XML reports...

THREAD: 140529358448384
----------------------------------------------------------------------

Running tests...
----------------------------------------------------------------------
  test_lzip (buildlzip.BuildLzipTest) ... OK (5.846s)

----------------------------------------------------------------------
Ran 1 test in 5.871s

OK

Generating XML reports...

THREAD: 140529358448384
----------------------------------------------------------------------

Running tests...
----------------------------------------------------------------------
  test_lzip (buildlzip.BuildLzipTest) ... OK (6.061s)

----------------------------------------------------------------------
Ran 1 test in 6.083s

OK

Generating XML reports...

THREAD: 140529471145728
----------------------------------------------------------------------

Running tests...
----------------------------------------------------------------------
  test_cpio (buildcpio.BuildCpioTest) ... OK (36.709s)

----------------------------------------------------------------------
Ran 1 test in 36.864s

OK

Generating XML reports...

THREAD: 140529471145728
----------------------------------------------------------------------

Running tests...
----------------------------------------------------------------------
  test_cpio (buildcpio.BuildCpioTest) ... OK (36.482s)

----------------------------------------------------------------------
Ran 1 test in 36.655s

OK

Generating XML reports...

THREAD: 140528981112576
----------------------------------------------------------------------

Running tests...
----------------------------------------------------------------------
  test_devtool_location (devtool.DevtoolTest) ... OK (0.009s)
  test_devtool_add_reset (devtool.DevtoolTest) ... ERROR (3.082s)
  test_devtool_build_cmake (devtool.DevtoolTest) ... ERROR (2.896s)
  test_devtool_build_esdk_package (devtool.DevtoolTest) ... ERROR (2.917s)
  test_devtool_build_make (devtool.DevtoolTest) ... ERROR (2.968s)
  test_devtool_kernelmodule (devtool.DevtoolTest) ... ERROR (9.865s)
  test_extend_autotools_recipe_creation (devtool.DevtoolTest) ... ERROR (36.501s)
  test_recipes_for_nodejs (devtool.DevtoolTest) ... OK (14.848s)
  test_sdk_update_http (devtool.SdkUpdateTest) ... OK (45.685s)

======================================================================
ERROR [3.082s]: test_devtool_add_reset (devtool.DevtoolTest)
----------------------------------------------------------------------
Traceback (most recent call last):
  File "/home/pokybuild/yocto-autobuilder/yocto-worker/nightly-mips/build/meta/lib/oeqa/core/decorator/__init__.py", line 32, in wrapped_f
    return func(*args, **kwargs)
  File "/home/pokybuild/yocto-autobuilder/yocto-worker/nightly-mips/build/meta/lib/oeqa/sdkext/cases/devtool.py", line 50, in test_devtool_add_reset
    self._run('devtool add myapp %s' % self.myapp_dst)
  File "/home/pokybuild/yocto-autobuilder/yocto-worker/nightly-mips/build/meta/lib/oeqa/sdkext/case.py", line 21, in _run
    shell=True, env=env, universal_newlines=True)
  File "/usr/lib/python3.5/subprocess.py", line 626, in check_output
    **kwargs).stdout
  File "/usr/lib/python3.5/subprocess.py", line 708, in run
    output=stdout, stderr=stderr)
oeqa.utils.subprocesstweak.OETestCalledProcessError: Command '. /home/pokybuild/yocto-autobuilder/yocto-worker/nightly-mips/build/build/tmp/work/qemumips-poky-linux/core-image-minimal/1.0-r0/testsdkext/environment-setup-mips32r2-poky-linux > /dev/null; devtool add myapp /home/pokybuild/yocto-autobuilder/yocto-worker/nightly-mips/build/build/tmp/work/qemumips-poky-linux/core-image-minimal/1.0-r0/testsdkext/myapp;' returned non-zero exit status 1
Standard Output: NOTE: Starting bitbake server...
NOTE: Starting bitbake server...
NOTE: Starting bitbake server...
ERROR: Traceback (most recent call last):
  File "/home/pokybuild/yocto-autobuilder/yocto-worker/nightly-mips/build/build/tmp/work/qemumips-poky-linux/core-image-minimal/1.0-r0/testsdkext/layers/build/bitbake/lib/bb/command.py", line 83, in runCommand
    result = command_method(self, commandline)
  File "/home/pokybuild/yocto-autobuilder/yocto-worker/nightly-mips/build/build/tmp/work/qemumips-poky-linux/core-image-minimal/1.0-r0/testsdkext/layers/build/bitbake/lib/bb/command.py", line 566, in parseRecipeFile
    envdata = parser.loadDataFull(fn, appendfiles)
  File "/home/pokybuild/yocto-autobuilder/yocto-worker/nightly-mips/build/build/tmp/work/qemumips-poky-linux/core-image-minimal/1.0-r0/testsdkext/layers/build/bitbake/lib/bb/cache.py", line 339, in loadDataFull
    bb_data = self.load_bbfile(virtualfn, appends, virtonly=True)
  File "/home/pokybuild/yocto-autobuilder/yocto-worker/nightly-mips/build/build/tmp/work/qemumips-poky-linux/core-image-minimal/1.0-r0/testsdkext/layers/build/bitbake/lib/bb/cache.py", line 352, in load_bbfile
    datastores = parse_recipe(bb_data, bbfile, appends, mc)
  File "/home/pokybuild/yocto-autobuilder/yocto-worker/nightly-mips/build/build/tmp/work/qemumips-poky-linux/core-image-minimal/1.0-r0/testsdkext/layers/build/bitbake/lib/bb/cache.py", line 315, in parse_recipe
    bb_data = bb.parse.handle(bbfile, bb_data)
  File "/home/pokybuild/yocto-autobuilder/yocto-worker/nightly-mips/build/build/tmp/work/qemumips-poky-linux/core-image-minimal/1.0-r0/testsdkext/layers/build/bitbake/lib/bb/parse/__init__.py", line 113, in handle
    return h['handle'](fn, data, include)
  File "/home/pokybuild/yocto-autobuilder/yocto-worker/nightly-mips/build/build/tmp/work/qemumips-poky-linux/core-image-minimal/1.0-r0/testsdkext/layers/build/bitbake/lib/bb/parse/parse_py/BBHandler.py", line 157, in handle
    return ast.multi_finalize(fn, d)
  File "/home/pokybuild/yocto-autobuilder/yocto-worker/nightly-mips/build/build/tmp/work/qemumips-poky-linux/core-image-minimal/1.0-r0/testsdkext/layers/build/bitbake/lib/bb/parse/ast.py", line 395, in multi_finalize
    finalize(fn, d)
  File "/home/pokybuild/yocto-autobuilder/yocto-worker/nightly-mips/build/build/tmp/work/qemumips-poky-linux/core-image-minimal/1.0-r0/testsdkext/layers/build/bitbake/lib/bb/parse/ast.py", line 355, in finalize
    bb.utils.better_exec("\n".join(code), {"d": d})
  File "/home/pokybuild/yocto-autobuilder/yocto-worker/nightly-mips/build/build/tmp/work/qemumips-poky-linux/core-image-minimal/1.0-r0/testsdkext/layers/build/bitbake/lib/bb/utils.py", line 399, in better_exec
    exec(code, get_context(), context)
  File "<code>", line 3, in <module>
  File "/home/pokybuild/yocto-autobuilder/yocto-worker/nightly-mips/build/build/tmp/work/qemumips-poky-linux/core-image-minimal/1.0-r0/testsdkext/layers/build/meta/classes/base.bbclass", line 468, in __anon_686__home_pokybuild_yocto_autobuilder_yocto_worker_nightly_mips_build_build_tmp_work_qemumips_poky_linux_core_image_minimal_1_0_r0_testsdkext_layers_build_meta_classes_base_bbclass
  File "/home/pokybuild/yocto-autobuilder/yocto-worker/nightly-mips/build/build/tmp/work/qemumips-poky-linux/core-image-minimal/1.0-r0/testsdkext/layers/build/bitbake/lib/bb/__init__.py", line 104, in fatal
    raise BBHandledException()
bb.BBHandledException

ERROR: Parsing newly created recipe failed, moving recipe to /home/pokybuild/yocto-autobuilder/yocto-worker/nightly-mips/build/build/tmp/work/qemumips-poky-linux/core-image-minimal/1.0-r0/testsdkext/workspace/recipes/myapp/myapp.bb.parsefailed for reference. If this looks to be caused by the recipe itself, please report this error.


======================================================================
ERROR [2.896s]: test_devtool_build_cmake (devtool.DevtoolTest)
----------------------------------------------------------------------
Traceback (most recent call last):
  File "/home/pokybuild/yocto-autobuilder/yocto-worker/nightly-mips/build/meta/lib/oeqa/core/decorator/__init__.py", line 32, in wrapped_f
    return func(*args, **kwargs)
  File "/home/pokybuild/yocto-autobuilder/yocto-worker/nightly-mips/build/meta/lib/oeqa/core/decorator/__init__.py", line 32, in wrapped_f
    return func(*args, **kwargs)
  File "/home/pokybuild/yocto-autobuilder/yocto-worker/nightly-mips/build/meta/lib/oeqa/sdkext/cases/devtool.py", line 66, in test_devtool_build_cmake
    self._test_devtool_build(self.myapp_cmake_dst)
  File "/home/pokybuild/yocto-autobuilder/yocto-worker/nightly-mips/build/meta/lib/oeqa/sdkext/cases/devtool.py", line 30, in _test_devtool_build
    self._run('devtool add myapp %s' % directory)
  File "/home/pokybuild/yocto-autobuilder/yocto-worker/nightly-mips/build/meta/lib/oeqa/sdkext/case.py", line 21, in _run
    shell=True, env=env, universal_newlines=True)
  File "/usr/lib/python3.5/subprocess.py", line 626, in check_output
    **kwargs).stdout
  File "/usr/lib/python3.5/subprocess.py", line 708, in run
    output=stdout, stderr=stderr)
oeqa.utils.subprocesstweak.OETestCalledProcessError: Command '. /home/pokybuild/yocto-autobuilder/yocto-worker/nightly-mips/build/build/tmp/work/qemumips-poky-linux/core-image-minimal/1.0-r0/testsdkext/environment-setup-mips32r2-poky-linux > /dev/null; devtool add myapp /home/pokybuild/yocto-autobuilder/yocto-worker/nightly-mips/build/build/tmp/work/qemumips-poky-linux/core-image-minimal/1.0-r0/testsdkext/myapp_cmake;' returned non-zero exit status 1
Standard Output: NOTE: Starting bitbake server...
NOTE: Starting bitbake server...
NOTE: Starting bitbake server...
ERROR: Traceback (most recent call last):
  File "/home/pokybuild/yocto-autobuilder/yocto-worker/nightly-mips/build/build/tmp/work/qemumips-poky-linux/core-image-minimal/1.0-r0/testsdkext/layers/build/bitbake/lib/bb/command.py", line 83, in runCommand
    result = command_method(self, commandline)
  File "/home/pokybuild/yocto-autobuilder/yocto-worker/nightly-mips/build/build/tmp/work/qemumips-poky-linux/core-image-minimal/1.0-r0/testsdkext/layers/build/bitbake/lib/bb/command.py", line 566, in parseRecipeFile
    envdata = parser.loadDataFull(fn, appendfiles)
  File "/home/pokybuild/yocto-autobuilder/yocto-worker/nightly-mips/build/build/tmp/work/qemumips-poky-linux/core-image-minimal/1.0-r0/testsdkext/layers/build/bitbake/lib/bb/cache.py", line 339, in loadDataFull
    bb_data = self.load_bbfile(virtualfn, appends, virtonly=True)
  File "/home/pokybuild/yocto-autobuilder/yocto-worker/nightly-mips/build/build/tmp/work/qemumips-poky-linux/core-image-minimal/1.0-r0/testsdkext/layers/build/bitbake/lib/bb/cache.py", line 352, in load_bbfile
    datastores = parse_recipe(bb_data, bbfile, appends, mc)
  File "/home/pokybuild/yocto-autobuilder/yocto-worker/nightly-mips/build/build/tmp/work/qemumips-poky-linux/core-image-minimal/1.0-r0/testsdkext/layers/build/bitbake/lib/bb/cache.py", line 315, in parse_recipe
    bb_data = bb.parse.handle(bbfile, bb_data)
  File "/home/pokybuild/yocto-autobuilder/yocto-worker/nightly-mips/build/build/tmp/work/qemumips-poky-linux/core-image-minimal/1.0-r0/testsdkext/layers/build/bitbake/lib/bb/parse/__init__.py", line 113, in handle
    return h['handle'](fn, data, include)
  File "/home/pokybuild/yocto-autobuilder/yocto-worker/nightly-mips/build/build/tmp/work/qemumips-poky-linux/core-image-minimal/1.0-r0/testsdkext/layers/build/bitbake/lib/bb/parse/parse_py/BBHandler.py", line 157, in handle
    return ast.multi_finalize(fn, d)
  File "/home/pokybuild/yocto-autobuilder/yocto-worker/nightly-mips/build/build/tmp/work/qemumips-poky-linux/core-image-minimal/1.0-r0/testsdkext/layers/build/bitbake/lib/bb/parse/ast.py", line 395, in multi_finalize
    finalize(fn, d)
  File "/home/pokybuild/yocto-autobuilder/yocto-worker/nightly-mips/build/build/tmp/work/qemumips-poky-linux/core-image-minimal/1.0-r0/testsdkext/layers/build/bitbake/lib/bb/parse/ast.py", line 355, in finalize
    bb.utils.better_exec("\n".join(code), {"d": d})
  File "/home/pokybuild/yocto-autobuilder/yocto-worker/nightly-mips/build/build/tmp/work/qemumips-poky-linux/core-image-minimal/1.0-r0/testsdkext/layers/build/bitbake/lib/bb/utils.py", line 399, in better_exec
    exec(code, get_context(), context)
  File "<code>", line 3, in <module>
  File "/home/pokybuild/yocto-autobuilder/yocto-worker/nightly-mips/build/build/tmp/work/qemumips-poky-linux/core-image-minimal/1.0-r0/testsdkext/layers/build/meta/classes/base.bbclass", line 468, in __anon_686__home_pokybuild_yocto_autobuilder_yocto_worker_nightly_mips_build_build_tmp_work_qemumips_poky_linux_core_image_minimal_1_0_r0_testsdkext_layers_build_meta_classes_base_bbclass
  File "/home/pokybuild/yocto-autobuilder/yocto-worker/nightly-mips/build/build/tmp/work/qemumips-poky-linux/core-image-minimal/1.0-r0/testsdkext/layers/build/bitbake/lib/bb/__init__.py", line 104, in fatal
    raise BBHandledException()
bb.BBHandledException

ERROR: Parsing newly created recipe failed, moving recipe to /home/pokybuild/yocto-autobuilder/yocto-worker/nightly-mips/build/build/tmp/work/qemumips-poky-linux/core-image-minimal/1.0-r0/testsdkext/workspace/recipes/myapp/myapp.bb.parsefailed for reference. If this looks to be caused by the recipe itself, please report this error.


======================================================================
ERROR [2.917s]: test_devtool_build_esdk_package (devtool.DevtoolTest)
----------------------------------------------------------------------
Traceback (most recent call last):
  File "/home/pokybuild/yocto-autobuilder/yocto-worker/nightly-mips/build/meta/lib/oeqa/core/decorator/__init__.py", line 32, in wrapped_f
    return func(*args, **kwargs)
  File "/home/pokybuild/yocto-autobuilder/yocto-worker/nightly-mips/build/meta/lib/oeqa/core/decorator/__init__.py", line 32, in wrapped_f
    return func(*args, **kwargs)
  File "/home/pokybuild/yocto-autobuilder/yocto-worker/nightly-mips/build/meta/lib/oeqa/sdkext/cases/devtool.py", line 61, in test_devtool_build_esdk_package
    self._test_devtool_build_package(self.myapp_dst)
  File "/home/pokybuild/yocto-autobuilder/yocto-worker/nightly-mips/build/meta/lib/oeqa/sdkext/cases/devtool.py", line 37, in _test_devtool_build_package
    self._run('devtool add myapp %s' % directory)
  File "/home/pokybuild/yocto-autobuilder/yocto-worker/nightly-mips/build/meta/lib/oeqa/sdkext/case.py", line 21, in _run
    shell=True, env=env, universal_newlines=True)
  File "/usr/lib/python3.5/subprocess.py", line 626, in check_output
    **kwargs).stdout
  File "/usr/lib/python3.5/subprocess.py", line 708, in run
    output=stdout, stderr=stderr)
oeqa.utils.subprocesstweak.OETestCalledProcessError: Command '. /home/pokybuild/yocto-autobuilder/yocto-worker/nightly-mips/build/build/tmp/work/qemumips-poky-linux/core-image-minimal/1.0-r0/testsdkext/environment-setup-mips32r2-poky-linux > /dev/null; devtool add myapp /home/pokybuild/yocto-autobuilder/yocto-worker/nightly-mips/build/build/tmp/work/qemumips-poky-linux/core-image-minimal/1.0-r0/testsdkext/myapp;' returned non-zero exit status 1
Standard Output: NOTE: Starting bitbake server...
NOTE: Starting bitbake server...
NOTE: Starting bitbake server...
ERROR: Traceback (most recent call last):
  File "/home/pokybuild/yocto-autobuilder/yocto-worker/nightly-mips/build/build/tmp/work/qemumips-poky-linux/core-image-minimal/1.0-r0/testsdkext/layers/build/bitbake/lib/bb/command.py", line 83, in runCommand
    result = command_method(self, commandline)
  File "/home/pokybuild/yocto-autobuilder/yocto-worker/nightly-mips/build/build/tmp/work/qemumips-poky-linux/core-image-minimal/1.0-r0/testsdkext/layers/build/bitbake/lib/bb/command.py", line 566, in parseRecipeFile
    envdata = parser.loadDataFull(fn, appendfiles)
  File "/home/pokybuild/yocto-autobuilder/yocto-worker/nightly-mips/build/build/tmp/work/qemumips-poky-linux/core-image-minimal/1.0-r0/testsdkext/layers/build/bitbake/lib/bb/cache.py", line 339, in loadDataFull
    bb_data = self.load_bbfile(virtualfn, appends, virtonly=True)
  File "/home/pokybuild/yocto-autobuilder/yocto-worker/nightly-mips/build/build/tmp/work/qemumips-poky-linux/core-image-minimal/1.0-r0/testsdkext/layers/build/bitbake/lib/bb/cache.py", line 352, in load_bbfile
    datastores = parse_recipe(bb_data, bbfile, appends, mc)
  File "/home/pokybuild/yocto-autobuilder/yocto-worker/nightly-mips/build/build/tmp/work/qemumips-poky-linux/core-image-minimal/1.0-r0/testsdkext/layers/build/bitbake/lib/bb/cache.py", line 315, in parse_recipe
    bb_data = bb.parse.handle(bbfile, bb_data)
  File "/home/pokybuild/yocto-autobuilder/yocto-worker/nightly-mips/build/build/tmp/work/qemumips-poky-linux/core-image-minimal/1.0-r0/testsdkext/layers/build/bitbake/lib/bb/parse/__init__.py", line 113, in handle
    return h['handle'](fn, data, include)
  File "/home/pokybuild/yocto-autobuilder/yocto-worker/nightly-mips/build/build/tmp/work/qemumips-poky-linux/core-image-minimal/1.0-r0/testsdkext/layers/build/bitbake/lib/bb/parse/parse_py/BBHandler.py", line 157, in handle
    return ast.multi_finalize(fn, d)
  File "/home/pokybuild/yocto-autobuilder/yocto-worker/nightly-mips/build/build/tmp/work/qemumips-poky-linux/core-image-minimal/1.0-r0/testsdkext/layers/build/bitbake/lib/bb/parse/ast.py", line 395, in multi_finalize
    finalize(fn, d)
  File "/home/pokybuild/yocto-autobuilder/yocto-worker/nightly-mips/build/build/tmp/work/qemumips-poky-linux/core-image-minimal/1.0-r0/testsdkext/layers/build/bitbake/lib/bb/parse/ast.py", line 355, in finalize
    bb.utils.better_exec("\n".join(code), {"d": d})
  File "/home/pokybuild/yocto-autobuilder/yocto-worker/nightly-mips/build/build/tmp/work/qemumips-poky-linux/core-image-minimal/1.0-r0/testsdkext/layers/build/bitbake/lib/bb/utils.py", line 399, in better_exec
    exec(code, get_context(), context)
  File "<code>", line 3, in <module>
  File "/home/pokybuild/yocto-autobuilder/yocto-worker/nightly-mips/build/build/tmp/work/qemumips-poky-linux/core-image-minimal/1.0-r0/testsdkext/layers/build/meta/classes/base.bbclass", line 468, in __anon_686__home_pokybuild_yocto_autobuilder_yocto_worker_nightly_mips_build_build_tmp_work_qemumips_poky_linux_core_image_minimal_1_0_r0_testsdkext_layers_build_meta_classes_base_bbclass
  File "/home/pokybuild/yocto-autobuilder/yocto-worker/nightly-mips/build/build/tmp/work/qemumips-poky-linux/core-image-minimal/1.0-r0/testsdkext/layers/build/bitbake/lib/bb/__init__.py", line 104, in fatal
    raise BBHandledException()
bb.BBHandledException

ERROR: Parsing newly created recipe failed, moving recipe to /home/pokybuild/yocto-autobuilder/yocto-worker/nightly-mips/build/build/tmp/work/qemumips-poky-linux/core-image-minimal/1.0-r0/testsdkext/workspace/recipes/myapp/myapp.bb.parsefailed for reference. If this looks to be caused by the recipe itself, please report this error.


======================================================================
ERROR [2.968s]: test_devtool_build_make (devtool.DevtoolTest)
----------------------------------------------------------------------
Traceback (most recent call last):
  File "/home/pokybuild/yocto-autobuilder/yocto-worker/nightly-mips/build/meta/lib/oeqa/core/decorator/__init__.py", line 32, in wrapped_f
    return func(*args, **kwargs)
  File "/home/pokybuild/yocto-autobuilder/yocto-worker/nightly-mips/build/meta/lib/oeqa/core/decorator/__init__.py", line 32, in wrapped_f
    return func(*args, **kwargs)
  File "/home/pokybuild/yocto-autobuilder/yocto-worker/nightly-mips/build/meta/lib/oeqa/sdkext/cases/devtool.py", line 56, in test_devtool_build_make
    self._test_devtool_build(self.myapp_dst)
  File "/home/pokybuild/yocto-autobuilder/yocto-worker/nightly-mips/build/meta/lib/oeqa/sdkext/cases/devtool.py", line 30, in _test_devtool_build
    self._run('devtool add myapp %s' % directory)
  File "/home/pokybuild/yocto-autobuilder/yocto-worker/nightly-mips/build/meta/lib/oeqa/sdkext/case.py", line 21, in _run
    shell=True, env=env, universal_newlines=True)
  File "/usr/lib/python3.5/subprocess.py", line 626, in check_output
    **kwargs).stdout
  File "/usr/lib/python3.5/subprocess.py", line 708, in run
    output=stdout, stderr=stderr)
oeqa.utils.subprocesstweak.OETestCalledProcessError: Command '. /home/pokybuild/yocto-autobuilder/yocto-worker/nightly-mips/build/build/tmp/work/qemumips-poky-linux/core-image-minimal/1.0-r0/testsdkext/environment-setup-mips32r2-poky-linux > /dev/null; devtool add myapp /home/pokybuild/yocto-autobuilder/yocto-worker/nightly-mips/build/build/tmp/work/qemumips-poky-linux/core-image-minimal/1.0-r0/testsdkext/myapp;' returned non-zero exit status 1
Standard Output: NOTE: Starting bitbake server...
NOTE: Starting bitbake server...
NOTE: Starting bitbake server...
ERROR: Traceback (most recent call last):
  File "/home/pokybuild/yocto-autobuilder/yocto-worker/nightly-mips/build/build/tmp/work/qemumips-poky-linux/core-image-minimal/1.0-r0/testsdkext/layers/build/bitbake/lib/bb/command.py", line 83, in runCommand
    result = command_method(self, commandline)
  File "/home/pokybuild/yocto-autobuilder/yocto-worker/nightly-mips/build/build/tmp/work/qemumips-poky-linux/core-image-minimal/1.0-r0/testsdkext/layers/build/bitbake/lib/bb/command.py", line 566, in parseRecipeFile
    envdata = parser.loadDataFull(fn, appendfiles)
  File "/home/pokybuild/yocto-autobuilder/yocto-worker/nightly-mips/build/build/tmp/work/qemumips-poky-linux/core-image-minimal/1.0-r0/testsdkext/layers/build/bitbake/lib/bb/cache.py", line 339, in loadDataFull
    bb_data = self.load_bbfile(virtualfn, appends, virtonly=True)
  File "/home/pokybuild/yocto-autobuilder/yocto-worker/nightly-mips/build/build/tmp/work/qemumips-poky-linux/core-image-minimal/1.0-r0/testsdkext/layers/build/bitbake/lib/bb/cache.py", line 352, in load_bbfile
    datastores = parse_recipe(bb_data, bbfile, appends, mc)
  File "/home/pokybuild/yocto-autobuilder/yocto-worker/nightly-mips/build/build/tmp/work/qemumips-poky-linux/core-image-minimal/1.0-r0/testsdkext/layers/build/bitbake/lib/bb/cache.py", line 315, in parse_recipe
    bb_data = bb.parse.handle(bbfile, bb_data)
  File "/home/pokybuild/yocto-autobuilder/yocto-worker/nightly-mips/build/build/tmp/work/qemumips-poky-linux/core-image-minimal/1.0-r0/testsdkext/layers/build/bitbake/lib/bb/parse/__init__.py", line 113, in handle
    return h['handle'](fn, data, include)
  File "/home/pokybuild/yocto-autobuilder/yocto-worker/nightly-mips/build/build/tmp/work/qemumips-poky-linux/core-image-minimal/1.0-r0/testsdkext/layers/build/bitbake/lib/bb/parse/parse_py/BBHandler.py", line 157, in handle
    return ast.multi_finalize(fn, d)
  File "/home/pokybuild/yocto-autobuilder/yocto-worker/nightly-mips/build/build/tmp/work/qemumips-poky-linux/core-image-minimal/1.0-r0/testsdkext/layers/build/bitbake/lib/bb/parse/ast.py", line 395, in multi_finalize
    finalize(fn, d)
  File "/home/pokybuild/yocto-autobuilder/yocto-worker/nightly-mips/build/build/tmp/work/qemumips-poky-linux/core-image-minimal/1.0-r0/testsdkext/layers/build/bitbake/lib/bb/parse/ast.py", line 355, in finalize
    bb.utils.better_exec("\n".join(code), {"d": d})
  File "/home/pokybuild/yocto-autobuilder/yocto-worker/nightly-mips/build/build/tmp/work/qemumips-poky-linux/core-image-minimal/1.0-r0/testsdkext/layers/build/bitbake/lib/bb/utils.py", line 399, in better_exec
    exec(code, get_context(), context)
  File "<code>", line 3, in <module>
  File "/home/pokybuild/yocto-autobuilder/yocto-worker/nightly-mips/build/build/tmp/work/qemumips-poky-linux/core-image-minimal/1.0-r0/testsdkext/layers/build/meta/classes/base.bbclass", line 468, in __anon_686__home_pokybuild_yocto_autobuilder_yocto_worker_nightly_mips_build_build_tmp_work_qemumips_poky_linux_core_image_minimal_1_0_r0_testsdkext_layers_build_meta_classes_base_bbclass
  File "/home/pokybuild/yocto-autobuilder/yocto-worker/nightly-mips/build/build/tmp/work/qemumips-poky-linux/core-image-minimal/1.0-r0/testsdkext/layers/build/bitbake/lib/bb/__init__.py", line 104, in fatal
    raise BBHandledException()
bb.BBHandledException

ERROR: Parsing newly created recipe failed, moving recipe to /home/pokybuild/yocto-autobuilder/yocto-worker/nightly-mips/build/build/tmp/work/qemumips-poky-linux/core-image-minimal/1.0-r0/testsdkext/workspace/recipes/myapp/myapp.bb.parsefailed for reference. If this looks to be caused by the recipe itself, please report this error.


======================================================================
ERROR [9.865s]: test_devtool_kernelmodule (devtool.DevtoolTest)
----------------------------------------------------------------------
Traceback (most recent call last):
  File "/home/pokybuild/yocto-autobuilder/yocto-worker/nightly-mips/build/meta/lib/oeqa/core/decorator/__init__.py", line 32, in wrapped_f
    return func(*args, **kwargs)
  File "/home/pokybuild/yocto-autobuilder/yocto-worker/nightly-mips/build/meta/lib/oeqa/core/decorator/__init__.py", line 32, in wrapped_f
    return func(*args, **kwargs)
  File "/home/pokybuild/yocto-autobuilder/yocto-worker/nightly-mips/build/meta/lib/oeqa/sdkext/cases/devtool.py", line 85, in test_devtool_kernelmodule
    self._run('devtool add %s %s' % (recipe, docfile) )
  File "/home/pokybuild/yocto-autobuilder/yocto-worker/nightly-mips/build/meta/lib/oeqa/sdkext/case.py", line 21, in _run
    shell=True, env=env, universal_newlines=True)
  File "/usr/lib/python3.5/subprocess.py", line 626, in check_output
    **kwargs).stdout
  File "/usr/lib/python3.5/subprocess.py", line 708, in run
    output=stdout, stderr=stderr)
oeqa.utils.subprocesstweak.OETestCalledProcessError: Command '. /home/pokybuild/yocto-autobuilder/yocto-worker/nightly-mips/build/build/tmp/work/qemumips-poky-linux/core-image-minimal/1.0-r0/testsdkext/environment-setup-mips32r2-poky-linux > /dev/null; devtool add v4l2loopback-driver https://github.com/umlaeute/v4l2loopback.git;' returned non-zero exit status 1
Standard Output: NOTE: Starting bitbake server...
NOTE: Starting bitbake server...
NOTE: Fetching git://github.com/umlaeute/v4l2loopback.git;protocol=https...
NOTE: Starting bitbake server...
Loading cache...done.
Loaded 1258 entries from dependency cache.
Parsing recipes...done.
Parsing of 810 .bb files complete (809 cached, 1 parsed). 1259 targets, 69 skipped, 0 masked, 0 errors.
NOTE: Resolving any missing task queue dependencies
Initialising tasks...done.
NOTE: Executing RunQueue Tasks
NOTE: Tasks Summary: Attempted 2 tasks of which 0 didn't need to be rerun and all succeeded.
NOTE: Using default source tree path /home/pokybuild/yocto-autobuilder/yocto-worker/nightly-mips/build/build/tmp/work/qemumips-poky-linux/core-image-minimal/1.0-r0/testsdkext/workspace/sources/v4l2loopback-driver
NOTE: Starting bitbake server...
ERROR: Traceback (most recent call last):
  File "/home/pokybuild/yocto-autobuilder/yocto-worker/nightly-mips/build/build/tmp/work/qemumips-poky-linux/core-image-minimal/1.0-r0/testsdkext/layers/build/bitbake/lib/bb/command.py", line 83, in runCommand
    result = command_method(self, commandline)
  File "/home/pokybuild/yocto-autobuilder/yocto-worker/nightly-mips/build/build/tmp/work/qemumips-poky-linux/core-image-minimal/1.0-r0/testsdkext/layers/build/bitbake/lib/bb/command.py", line 566, in parseRecipeFile
    envdata = parser.loadDataFull(fn, appendfiles)
  File "/home/pokybuild/yocto-autobuilder/yocto-worker/nightly-mips/build/build/tmp/work/qemumips-poky-linux/core-image-minimal/1.0-r0/testsdkext/layers/build/bitbake/lib/bb/cache.py", line 339, in loadDataFull
    bb_data = self.load_bbfile(virtualfn, appends, virtonly=True)
  File "/home/pokybuild/yocto-autobuilder/yocto-worker/nightly-mips/build/build/tmp/work/qemumips-poky-linux/core-image-minimal/1.0-r0/testsdkext/layers/build/bitbake/lib/bb/cache.py", line 352, in load_bbfile
    datastores = parse_recipe(bb_data, bbfile, appends, mc)
  File "/home/pokybuild/yocto-autobuilder/yocto-worker/nightly-mips/build/build/tmp/work/qemumips-poky-linux/core-image-minimal/1.0-r0/testsdkext/layers/build/bitbake/lib/bb/cache.py", line 315, in parse_recipe
    bb_data = bb.parse.handle(bbfile, bb_data)
  File "/home/pokybuild/yocto-autobuilder/yocto-worker/nightly-mips/build/build/tmp/work/qemumips-poky-linux/core-image-minimal/1.0-r0/testsdkext/layers/build/bitbake/lib/bb/parse/__init__.py", line 113, in handle
    return h['handle'](fn, data, include)
  File "/home/pokybuild/yocto-autobuilder/yocto-worker/nightly-mips/build/build/tmp/work/qemumips-poky-linux/core-image-minimal/1.0-r0/testsdkext/layers/build/bitbake/lib/bb/parse/parse_py/BBHandler.py", line 157, in handle
    return ast.multi_finalize(fn, d)
  File "/home/pokybuild/yocto-autobuilder/yocto-worker/nightly-mips/build/build/tmp/work/qemumips-poky-linux/core-image-minimal/1.0-r0/testsdkext/layers/build/bitbake/lib/bb/parse/ast.py", line 395, in multi_finalize
    finalize(fn, d)
  File "/home/pokybuild/yocto-autobuilder/yocto-worker/nightly-mips/build/build/tmp/work/qemumips-poky-linux/core-image-minimal/1.0-r0/testsdkext/layers/build/bitbake/lib/bb/parse/ast.py", line 355, in finalize
    bb.utils.better_exec("\n".join(code), {"d": d})
  File "/home/pokybuild/yocto-autobuilder/yocto-worker/nightly-mips/build/build/tmp/work/qemumips-poky-linux/core-image-minimal/1.0-r0/testsdkext/layers/build/bitbake/lib/bb/utils.py", line 399, in better_exec
    exec(code, get_context(), context)
  File "<code>", line 3, in <module>
  File "/home/pokybuild/yocto-autobuilder/yocto-worker/nightly-mips/build/build/tmp/work/qemumips-poky-linux/core-image-minimal/1.0-r0/testsdkext/layers/build/meta/classes/base.bbclass", line 468, in __anon_686__home_pokybuild_yocto_autobuilder_yocto_worker_nightly_mips_build_build_tmp_work_qemumips_poky_linux_core_image_minimal_1_0_r0_testsdkext_layers_build_meta_classes_base_bbclass
  File "/home/pokybuild/yocto-autobuilder/yocto-worker/nightly-mips/build/build/tmp/work/qemumips-poky-linux/core-image-minimal/1.0-r0/testsdkext/layers/build/bitbake/lib/bb/__init__.py", line 104, in fatal
    raise BBHandledException()
bb.BBHandledException

ERROR: Parsing newly created recipe failed, moving recipe to /home/pokybuild/yocto-autobuilder/yocto-worker/nightly-mips/build/build/tmp/work/qemumips-poky-linux/core-image-minimal/1.0-r0/testsdkext/workspace/recipes/v4l2loopback-driver/v4l2loopback-driver_git.bb.parsefailed for reference. If this looks to be caused by the recipe itself, please report this error.


======================================================================
ERROR [36.501s]: test_extend_autotools_recipe_creation (devtool.DevtoolTest)
----------------------------------------------------------------------
Traceback (most recent call last):
  File "/home/pokybuild/yocto-autobuilder/yocto-worker/nightly-mips/build/meta/lib/oeqa/core/decorator/__init__.py", line 32, in wrapped_f
    return func(*args, **kwargs)
  File "/home/pokybuild/yocto-autobuilder/yocto-worker/nightly-mips/build/meta/lib/oeqa/core/decorator/__init__.py", line 32, in wrapped_f
    return func(*args, **kwargs)
  File "/home/pokybuild/yocto-autobuilder/yocto-worker/nightly-mips/build/meta/lib/oeqa/sdkext/cases/devtool.py", line 74, in test_extend_autotools_recipe_creation
    self._run('devtool add %s %s' % (recipe, req) )
  File "/home/pokybuild/yocto-autobuilder/yocto-worker/nightly-mips/build/meta/lib/oeqa/sdkext/case.py", line 21, in _run
    shell=True, env=env, universal_newlines=True)
  File "/usr/lib/python3.5/subprocess.py", line 626, in check_output
    **kwargs).stdout
  File "/usr/lib/python3.5/subprocess.py", line 708, in run
    output=stdout, stderr=stderr)
oeqa.utils.subprocesstweak.OETestCalledProcessError: Command '. /home/pokybuild/yocto-autobuilder/yocto-worker/nightly-mips/build/build/tmp/work/qemumips-poky-linux/core-image-minimal/1.0-r0/testsdkext/environment-setup-mips32r2-poky-linux > /dev/null; devtool add librdfa https://github.com/rdfa/librdfa;' returned non-zero exit status 1
Standard Output: NOTE: Starting bitbake server...
NOTE: Starting bitbake server...
NOTE: Fetching git://github.com/rdfa/librdfa;protocol=https...
NOTE: Starting bitbake server...
Loading cache...done.
Loaded 1258 entries from dependency cache.
Parsing recipes...done.
Parsing of 810 .bb files complete (809 cached, 1 parsed). 1259 targets, 69 skipped, 0 masked, 0 errors.
NOTE: Resolving any missing task queue dependencies
Initialising tasks...done.
NOTE: Executing RunQueue Tasks
NOTE: Tasks Summary: Attempted 2 tasks of which 0 didn't need to be rerun and all succeeded.
NOTE: Using default source tree path /home/pokybuild/yocto-autobuilder/yocto-worker/nightly-mips/build/build/tmp/work/qemumips-poky-linux/core-image-minimal/1.0-r0/testsdkext/workspace/sources/librdfa
NOTE: Starting bitbake server...
ERROR: Traceback (most recent call last):
  File "/home/pokybuild/yocto-autobuilder/yocto-worker/nightly-mips/build/build/tmp/work/qemumips-poky-linux/core-image-minimal/1.0-r0/testsdkext/layers/build/bitbake/lib/bb/command.py", line 83, in runCommand
    result = command_method(self, commandline)
  File "/home/pokybuild/yocto-autobuilder/yocto-worker/nightly-mips/build/build/tmp/work/qemumips-poky-linux/core-image-minimal/1.0-r0/testsdkext/layers/build/bitbake/lib/bb/command.py", line 566, in parseRecipeFile
    envdata = parser.loadDataFull(fn, appendfiles)
  File "/home/pokybuild/yocto-autobuilder/yocto-worker/nightly-mips/build/build/tmp/work/qemumips-poky-linux/core-image-minimal/1.0-r0/testsdkext/layers/build/bitbake/lib/bb/cache.py", line 339, in loadDataFull
    bb_data = self.load_bbfile(virtualfn, appends, virtonly=True)
  File "/home/pokybuild/yocto-autobuilder/yocto-worker/nightly-mips/build/build/tmp/work/qemumips-poky-linux/core-image-minimal/1.0-r0/testsdkext/layers/build/bitbake/lib/bb/cache.py", line 352, in load_bbfile
    datastores = parse_recipe(bb_data, bbfile, appends, mc)
  File "/home/pokybuild/yocto-autobuilder/yocto-worker/nightly-mips/build/build/tmp/work/qemumips-poky-linux/core-image-minimal/1.0-r0/testsdkext/layers/build/bitbake/lib/bb/cache.py", line 315, in parse_recipe
    bb_data = bb.parse.handle(bbfile, bb_data)
  File "/home/pokybuild/yocto-autobuilder/yocto-worker/nightly-mips/build/build/tmp/work/qemumips-poky-linux/core-image-minimal/1.0-r0/testsdkext/layers/build/bitbake/lib/bb/parse/__init__.py", line 113, in handle
    return h['handle'](fn, data, include)
  File "/home/pokybuild/yocto-autobuilder/yocto-worker/nightly-mips/build/build/tmp/work/qemumips-poky-linux/core-image-minimal/1.0-r0/testsdkext/layers/build/bitbake/lib/bb/parse/parse_py/BBHandler.py", line 157, in handle
    return ast.multi_finalize(fn, d)
  File "/home/pokybuild/yocto-autobuilder/yocto-worker/nightly-mips/build/build/tmp/work/qemumips-poky-linux/core-image-minimal/1.0-r0/testsdkext/layers/build/bitbake/lib/bb/parse/ast.py", line 395, in multi_finalize
    finalize(fn, d)
  File "/home/pokybuild/yocto-autobuilder/yocto-worker/nightly-mips/build/build/tmp/work/qemumips-poky-linux/core-image-minimal/1.0-r0/testsdkext/layers/build/bitbake/lib/bb/parse/ast.py", line 355, in finalize
    bb.utils.better_exec("\n".join(code), {"d": d})
  File "/home/pokybuild/yocto-autobuilder/yocto-worker/nightly-mips/build/build/tmp/work/qemumips-poky-linux/core-image-minimal/1.0-r0/testsdkext/layers/build/bitbake/lib/bb/utils.py", line 399, in better_exec
    exec(code, get_context(), context)
  File "<code>", line 3, in <module>
  File "/home/pokybuild/yocto-autobuilder/yocto-worker/nightly-mips/build/build/tmp/work/qemumips-poky-linux/core-image-minimal/1.0-r0/testsdkext/layers/build/meta/classes/base.bbclass", line 468, in __anon_686__home_pokybuild_yocto_autobuilder_yocto_worker_nightly_mips_build_build_tmp_work_qemumips_poky_linux_core_image_minimal_1_0_r0_testsdkext_layers_build_meta_classes_base_bbclass
  File "/home/pokybuild/yocto-autobuilder/yocto-worker/nightly-mips/build/build/tmp/work/qemumips-poky-linux/core-image-minimal/1.0-r0/testsdkext/layers/build/bitbake/lib/bb/__init__.py", line 104, in fatal
    raise BBHandledException()
bb.BBHandledException
THREAD: 140528981112576

ERROR: Parsing newly created recipe failed, moving recipe to /home/pokybuild/yocto-autobuilder/yocto-worker/nightly-mips/build/build/tmp/work/qemumips-poky-linux/core-image-minimal/1.0-r0/testsdkext/workspace/recipes/librdfa/librdfa_git.bb.parsefailed for reference. If this looks to be caused by the recipe itself, please report this error.
----------------------------------------------------------------------



Running tests...
----------------------------------------------------------------------
Ran 9 tests in 140.740s
----------------------------------------------------------------------
  test_devtool_location (devtool.DevtoolTest) ... OK (0.007s)

FAILED (errors=6)
  test_devtool_add_reset (devtool.DevtoolTest) ... ERROR (3.176s)
  test_devtool_build_cmake (devtool.DevtoolTest) ... ERROR (2.960s)

Generating XML reports...
  test_devtool_build_esdk_package (devtool.DevtoolTest) ... ERROR (2.961s)
  test_devtool_build_make (devtool.DevtoolTest) ... ERROR (3.084s)

  test_devtool_kernelmodule (devtool.DevtoolTest) ... ERROR (10.301s)
  test_extend_autotools_recipe_creation (devtool.DevtoolTest) ... ERROR (35.695s)
  test_recipes_for_nodejs (devtool.DevtoolTest) ... OK (14.077s)
  test_sdk_update_http (devtool.SdkUpdateTest) ... OK (45.594s)

RESULTS:
======================================================================
ERROR [3.176s]: test_devtool_add_reset (devtool.DevtoolTest)
----------------------------------------------------------------------
Traceback (most recent call last):
  File "/home/pokybuild/yocto-autobuilder/yocto-worker/nightly-mips/build/meta/lib/oeqa/core/decorator/__init__.py", line 32, in wrapped_f
    return func(*args, **kwargs)
RESULTS - buildcpio.BuildCpioTest.test_cpio - Testcase -1: PASSED
RESULTS - buildgalculator.GalculatorTest.test_galculator - Testcase -1: SKIPPED
  File "/home/pokybuild/yocto-autobuilder/yocto-worker/nightly-mips/build/meta/lib/oeqa/sdkext/cases/devtool.py", line 50, in test_devtool_add_reset
    self._run('devtool add myapp %s' % self.myapp_dst)
  File "/home/pokybuild/yocto-autobuilder/yocto-worker/nightly-mips/build/meta/lib/oeqa/sdkext/case.py", line 21, in _run
    shell=True, env=env, universal_newlines=True)
RESULTS - buildlzip.BuildLzipTest.test_lzip - Testcase -1: PASSED
  File "/usr/lib/python3.5/subprocess.py", line 626, in check_output
    **kwargs).stdout
RESULTS - gcc.GccCompileTest.test_gcc_compile - Testcase -1: PASSED
  File "/usr/lib/python3.5/subprocess.py", line 708, in run
    output=stdout, stderr=stderr)
RESULTS - gcc.GccCompileTest.test_gpp2_compile - Testcase -1: PASSED
oeqa.utils.subprocesstweak.OETestCalledProcessError: Command '. /home/pokybuild/yocto-autobuilder/yocto-worker/nightly-mips/build/build/tmp/work/qemumips-poky-linux/core-image-sato/1.0-r0/testsdkext/environment-setup-mips32r2-poky-linux > /dev/null; devtool add myapp /home/pokybuild/yocto-autobuilder/yocto-worker/nightly-mips/build/build/tmp/work/qemumips-poky-linux/core-image-sato/1.0-r0/testsdkext/myapp;' returned non-zero exit status 1
Standard Output: NOTE: Starting bitbake server...
RESULTS - gcc.GccCompileTest.test_gpp_compile - Testcase -1: PASSED
NOTE: Starting bitbake server...
NOTE: Starting bitbake server...
RESULTS - gcc.GccCompileTest.test_make - Testcase -1: PASSED
ERROR: Traceback (most recent call last):
  File "/home/pokybuild/yocto-autobuilder/yocto-worker/nightly-mips/build/build/tmp/work/qemumips-poky-linux/core-image-sato/1.0-r0/testsdkext/layers/build/bitbake/lib/bb/command.py", line 83, in runCommand
RESULTS - perl.PerlTest.test_perl_exists - Testcase -1: SKIPPED
    result = command_method(self, commandline)
RESULTS - perl.PerlTest.test_perl_works - Testcase -1: SKIPPED
  File "/home/pokybuild/yocto-autobuilder/yocto-worker/nightly-mips/build/build/tmp/work/qemumips-poky-linux/core-image-sato/1.0-r0/testsdkext/layers/build/bitbake/lib/bb/command.py", line 566, in parseRecipeFile
    envdata = parser.loadDataFull(fn, appendfiles)
RESULTS - python.PythonTest.test_python_exists - Testcase -1: SKIPPED
RESULTS - python.PythonTest.test_python_stdout - Testcase -1: SKIPPED
  File "/home/pokybuild/yocto-autobuilder/yocto-worker/nightly-mips/build/build/tmp/work/qemumips-poky-linux/core-image-sato/1.0-r0/testsdkext/layers/build/bitbake/lib/bb/cache.py", line 339, in loadDataFull
    bb_data = self.load_bbfile(virtualfn, appends, virtonly=True)
  File "/home/pokybuild/yocto-autobuilder/yocto-worker/nightly-mips/build/build/tmp/work/qemumips-poky-linux/core-image-sato/1.0-r0/testsdkext/layers/build/bitbake/lib/bb/cache.py", line 352, in load_bbfile
    datastores = parse_recipe(bb_data, bbfile, appends, mc)
RESULTS - python.PythonTest.test_python_testfile - Testcase -1: SKIPPED
  File "/home/pokybuild/yocto-autobuilder/yocto-worker/nightly-mips/build/build/tmp/work/qemumips-poky-linux/core-image-sato/1.0-r0/testsdkext/layers/build/bitbake/lib/bb/cache.py", line 315, in parse_recipe
RESULTS - devtool.DevtoolTest.test_devtool_add_reset - Testcase -1: ERROR
    bb_data = bb.parse.handle(bbfile, bb_data)
  File "/home/pokybuild/yocto-autobuilder/yocto-worker/nightly-mips/build/build/tmp/work/qemumips-poky-linux/core-image-sato/1.0-r0/testsdkext/layers/build/bitbake/lib/bb/parse/__init__.py", line 113, in handle
RESULTS - devtool.DevtoolTest.test_devtool_build_cmake - Testcase 1607: ERROR
    return h['handle'](fn, data, include)
  File "/home/pokybuild/yocto-autobuilder/yocto-worker/nightly-mips/build/build/tmp/work/qemumips-poky-linux/core-image-sato/1.0-r0/testsdkext/layers/build/bitbake/lib/bb/parse/parse_py/BBHandler.py", line 157, in handle
RESULTS - devtool.DevtoolTest.test_devtool_build_esdk_package - Testcase 1606: ERROR
RESULTS - devtool.DevtoolTest.test_devtool_build_make - Testcase 1605: ERROR
    return ast.multi_finalize(fn, d)
  File "/home/pokybuild/yocto-autobuilder/yocto-worker/nightly-mips/build/build/tmp/work/qemumips-poky-linux/core-image-sato/1.0-r0/testsdkext/layers/build/bitbake/lib/bb/parse/ast.py", line 395, in multi_finalize
RESULTS - devtool.DevtoolTest.test_devtool_kernelmodule - Testcase 1609: ERROR
    finalize(fn, d)
  File "/home/pokybuild/yocto-autobuilder/yocto-worker/nightly-mips/build/build/tmp/work/qemumips-poky-linux/core-image-sato/1.0-r0/testsdkext/layers/build/bitbake/lib/bb/parse/ast.py", line 355, in finalize
RESULTS - devtool.DevtoolTest.test_devtool_location - Testcase -1: PASSED
    bb.utils.better_exec("\n".join(code), {"d": d})
  File "/home/pokybuild/yocto-autobuilder/yocto-worker/nightly-mips/build/build/tmp/work/qemumips-poky-linux/core-image-sato/1.0-r0/testsdkext/layers/build/bitbake/lib/bb/utils.py", line 399, in better_exec
RESULTS - devtool.DevtoolTest.test_extend_autotools_recipe_creation - Testcase 1608: ERROR
    exec(code, get_context(), context)
  File "<code>", line 3, in <module>
RESULTS - devtool.DevtoolTest.test_recipes_for_nodejs - Testcase 1610: PASSED
  File "/home/pokybuild/yocto-autobuilder/yocto-worker/nightly-mips/build/build/tmp/work/qemumips-poky-linux/core-image-sato/1.0-r0/testsdkext/layers/build/meta/classes/base.bbclass", line 468, in __anon_686__home_pokybuild_yocto_autobuilder_yocto_worker_nightly_mips_build_build_tmp_work_qemumips_poky_linux_core_image_sato_1_0_r0_testsdkext_layers_build_meta_classes_base_bbclass
  File "/home/pokybuild/yocto-autobuilder/yocto-worker/nightly-mips/build/build/tmp/work/qemumips-poky-linux/core-image-sato/1.0-r0/testsdkext/layers/build/bitbake/lib/bb/__init__.py", line 104, in fatal
RESULTS - devtool.SdkUpdateTest.test_sdk_update_http - Testcase -1: PASSED
SUMMARY:
    raise BBHandledException()
bb.BBHandledException
core-image-minimal esdk (poky-glibc-x86_64-core-image-minimal-mips32r2-toolchain-ext-2.3.sh:environment-setup-mips32r2-poky-linux) - Ran 21 tests in 140.780s
core-image-minimal esdk - FAIL - Required tests failed

ERROR: Parsing newly created recipe failed, moving recipe to /home/pokybuild/yocto-autobuilder/yocto-worker/nightly-mips/build/build/tmp/work/qemumips-poky-linux/core-image-sato/1.0-r0/testsdkext/workspace/recipes/myapp/myapp.bb.parsefailed for reference. If this looks to be caused by the recipe itself, please report this error.
ERROR: core-image-minimal-1.0-r0 do_testsdkext: core-image-minimal - FAILED - check the task log and the commands log


Stdout:
[Errno 17] File exists: '/home/pokybuild/yocto-autobuilder/yocto-worker/nightly-mips/build/build/TestResults_20170810012933_2846'

======================================================================
ERROR [2.960s]: test_devtool_build_cmake (devtool.DevtoolTest)
----------------------------------------------------------------------
ERROR: core-image-minimal-1.0-r0 do_testsdkext: Function failed: do_testsdkext
Traceback (most recent call last):
  File "/home/pokybuild/yocto-autobuilder/yocto-worker/nightly-mips/build/meta/lib/oeqa/core/decorator/__init__.py", line 32, in wrapped_f
    return func(*args, **kwargs)
  File "/home/pokybuild/yocto-autobuilder/yocto-worker/nightly-mips/build/meta/lib/oeqa/core/decorator/__init__.py", line 32, in wrapped_f
    return func(*args, **kwargs)
  File "/home/pokybuild/yocto-autobuilder/yocto-worker/nightly-mips/build/meta/lib/oeqa/sdkext/cases/devtool.py", line 66, in test_devtool_build_cmake
    self._test_devtool_build(self.myapp_cmake_dst)
  File "/home/pokybuild/yocto-autobuilder/yocto-worker/nightly-mips/build/meta/lib/oeqa/sdkext/cases/devtool.py", line 30, in _test_devtool_build
    self._run('devtool add myapp %s' % directory)
  File "/home/pokybuild/yocto-autobuilder/yocto-worker/nightly-mips/build/meta/lib/oeqa/sdkext/case.py", line 21, in _run
    shell=True, env=env, universal_newlines=True)
  File "/usr/lib/python3.5/subprocess.py", line 626, in check_output
    **kwargs).stdout
  File "/usr/lib/python3.5/subprocess.py", line 708, in run
    output=stdout, stderr=stderr)
oeqa.utils.subprocesstweak.OETestCalledProcessError: Command '. /home/pokybuild/yocto-autobuilder/yocto-worker/nightly-mips/build/build/tmp/work/qemumips-poky-linux/core-image-sato/1.0-r0/testsdkext/environment-setup-mips32r2-poky-linux > /dev/null; devtool add myapp /home/pokybuild/yocto-autobuilder/yocto-worker/nightly-mips/build/build/tmp/work/qemumips-poky-linux/core-image-sato/1.0-r0/testsdkext/myapp_cmake;' returned non-zero exit status 1
Standard Output: NOTE: Starting bitbake server...
NOTE: Starting bitbake server...
NOTE: Starting bitbake server...
ERROR: Traceback (most recent call last):
  File "/home/pokybuild/yocto-autobuilder/yocto-worker/nightly-mips/build/build/tmp/work/qemumips-poky-linux/core-image-sato/1.0-r0/testsdkext/layers/build/bitbake/lib/bb/command.py", line 83, in runCommand
    result = command_method(self, commandline)
  File "/home/pokybuild/yocto-autobuilder/yocto-worker/nightly-mips/build/build/tmp/work/qemumips-poky-linux/core-image-sato/1.0-r0/testsdkext/layers/build/bitbake/lib/bb/command.py", line 566, in parseRecipeFile
    envdata = parser.loadDataFull(fn, appendfiles)
  File "/home/pokybuild/yocto-autobuilder/yocto-worker/nightly-mips/build/build/tmp/work/qemumips-poky-linux/core-image-sato/1.0-r0/testsdkext/layers/build/bitbake/lib/bb/cache.py", line 339, in loadDataFull
    bb_data = self.load_bbfile(virtualfn, appends, virtonly=True)
  File "/home/pokybuild/yocto-autobuilder/yocto-worker/nightly-mips/build/build/tmp/work/qemumips-poky-linux/core-image-sato/1.0-r0/testsdkext/layers/build/bitbake/lib/bb/cache.py", line 352, in load_bbfile
    datastores = parse_recipe(bb_data, bbfile, appends, mc)
  File "/home/pokybuild/yocto-autobuilder/yocto-worker/nightly-mips/build/build/tmp/work/qemumips-poky-linux/core-image-sato/1.0-r0/testsdkext/layers/build/bitbake/lib/bb/cache.py", line 315, in parse_recipe
    bb_data = bb.parse.handle(bbfile, bb_data)
  File "/home/pokybuild/yocto-autobuilder/yocto-worker/nightly-mips/build/build/tmp/work/qemumips-poky-linux/core-image-sato/1.0-r0/testsdkext/layers/build/bitbake/lib/bb/parse/__init__.py", line 113, in handle
    return h['handle'](fn, data, include)
  File "/home/pokybuild/yocto-autobuilder/yocto-worker/nightly-mips/build/build/tmp/work/qemumips-poky-linux/core-image-sato/1.0-r0/testsdkext/layers/build/bitbake/lib/bb/parse/parse_py/BBHandler.py", line 157, in handle
    return ast.multi_finalize(fn, d)
  File "/home/pokybuild/yocto-autobuilder/yocto-worker/nightly-mips/build/build/tmp/work/qemumips-poky-linux/core-image-sato/1.0-r0/testsdkext/layers/build/bitbake/lib/bb/parse/ast.py", line 395, in multi_finalize
    finalize(fn, d)
  File "/home/pokybuild/yocto-autobuilder/yocto-worker/nightly-mips/build/build/tmp/work/qemumips-poky-linux/core-image-sato/1.0-r0/testsdkext/layers/build/bitbake/lib/bb/parse/ast.py", line 355, in finalize
    bb.utils.better_exec("\n".join(code), {"d": d})
  File "/home/pokybuild/yocto-autobuilder/yocto-worker/nightly-mips/build/build/tmp/work/qemumips-poky-linux/core-image-sato/1.0-r0/testsdkext/layers/build/bitbake/lib/bb/utils.py", line 399, in better_exec
    exec(code, get_context(), context)
  File "<code>", line 3, in <module>
ERROR: Logfile of failure stored in: /home/pokybuild/yocto-autobuilder/yocto-worker/nightly-mips/build/build/tmp/work/qemumips-poky-linux/core-image-minimal/1.0-r0/temp/log.do_testsdkext.2842
NOTE: recipe core-image-minimal-1.0-r0: task do_testsdkext: Failed
  File "/home/pokybuild/yocto-autobuilder/yocto-worker/nightly-mips/build/build/tmp/work/qemumips-poky-linux/core-image-sato/1.0-r0/testsdkext/layers/build/meta/classes/base.bbclass", line 468, in __anon_686__home_pokybuild_yocto_autobuilder_yocto_worker_nightly_mips_build_build_tmp_work_qemumips_poky_linux_core_image_sato_1_0_r0_testsdkext_layers_build_meta_classes_base_bbclass
  File "/home/pokybuild/yocto-autobuilder/yocto-worker/nightly-mips/build/build/tmp/work/qemumips-poky-linux/core-image-sato/1.0-r0/testsdkext/layers/build/bitbake/lib/bb/__init__.py", line 104, in fatal
    raise BBHandledException()
bb.BBHandledException

ERROR: Parsing newly created recipe failed, moving recipe to /home/pokybuild/yocto-autobuilder/yocto-worker/nightly-mips/build/build/tmp/work/qemumips-poky-linux/core-image-sato/1.0-r0/testsdkext/workspace/recipes/myapp/myapp.bb.parsefailed for reference. If this looks to be caused by the recipe itself, please report this error.


======================================================================
ERROR [2.961s]: test_devtool_build_esdk_package (devtool.DevtoolTest)
----------------------------------------------------------------------
Traceback (most recent call last):
  File "/home/pokybuild/yocto-autobuilder/yocto-worker/nightly-mips/build/meta/lib/oeqa/core/decorator/__init__.py", line 32, in wrapped_f
    return func(*args, **kwargs)
  File "/home/pokybuild/yocto-autobuilder/yocto-worker/nightly-mips/build/meta/lib/oeqa/core/decorator/__init__.py", line 32, in wrapped_f
    return func(*args, **kwargs)
  File "/home/pokybuild/yocto-autobuilder/yocto-worker/nightly-mips/build/meta/lib/oeqa/sdkext/cases/devtool.py", line 61, in test_devtool_build_esdk_package
    self._test_devtool_build_package(self.myapp_dst)
  File "/home/pokybuild/yocto-autobuilder/yocto-worker/nightly-mips/build/meta/lib/oeqa/sdkext/cases/devtool.py", line 37, in _test_devtool_build_package
    self._run('devtool add myapp %s' % directory)
  File "/home/pokybuild/yocto-autobuilder/yocto-worker/nightly-mips/build/meta/lib/oeqa/sdkext/case.py", line 21, in _run
    shell=True, env=env, universal_newlines=True)
  File "/usr/lib/python3.5/subprocess.py", line 626, in check_output
    **kwargs).stdout
  File "/usr/lib/python3.5/subprocess.py", line 708, in run
    output=stdout, stderr=stderr)
oeqa.utils.subprocesstweak.OETestCalledProcessError: Command '. /home/pokybuild/yocto-autobuilder/yocto-worker/nightly-mips/build/build/tmp/work/qemumips-poky-linux/core-image-sato/1.0-r0/testsdkext/environment-setup-mips32r2-poky-linux > /dev/null; devtool add myapp /home/pokybuild/yocto-autobuilder/yocto-worker/nightly-mips/build/build/tmp/work/qemumips-poky-linux/core-image-sato/1.0-r0/testsdkext/myapp;' returned non-zero exit status 1
Standard Output: NOTE: Starting bitbake server...
NOTE: Starting bitbake server...
ERROR: Task (/home/pokybuild/yocto-autobuilder/yocto-worker/nightly-mips/build/meta/recipes-core/images/core-image-minimal.bb:do_testsdkext) failed with exit code '1'
NOTE: Starting bitbake server...
ERROR: Traceback (most recent call last):
  File "/home/pokybuild/yocto-autobuilder/yocto-worker/nightly-mips/build/build/tmp/work/qemumips-poky-linux/core-image-sato/1.0-r0/testsdkext/layers/build/bitbake/lib/bb/command.py", line 83, in runCommand
    result = command_method(self, commandline)
  File "/home/pokybuild/yocto-autobuilder/yocto-worker/nightly-mips/build/build/tmp/work/qemumips-poky-linux/core-image-sato/1.0-r0/testsdkext/layers/build/bitbake/lib/bb/command.py", line 566, in parseRecipeFile
    envdata = parser.loadDataFull(fn, appendfiles)
  File "/home/pokybuild/yocto-autobuilder/yocto-worker/nightly-mips/build/build/tmp/work/qemumips-poky-linux/core-image-sato/1.0-r0/testsdkext/layers/build/bitbake/lib/bb/cache.py", line 339, in loadDataFull
    bb_data = self.load_bbfile(virtualfn, appends, virtonly=True)
  File "/home/pokybuild/yocto-autobuilder/yocto-worker/nightly-mips/build/build/tmp/work/qemumips-poky-linux/core-image-sato/1.0-r0/testsdkext/layers/build/bitbake/lib/bb/cache.py", line 352, in load_bbfile
    datastores = parse_recipe(bb_data, bbfile, appends, mc)
  File "/home/pokybuild/yocto-autobuilder/yocto-worker/nightly-mips/build/build/tmp/work/qemumips-poky-linux/core-image-sato/1.0-r0/testsdkext/layers/build/bitbake/lib/bb/cache.py", line 315, in parse_recipe
    bb_data = bb.parse.handle(bbfile, bb_data)
  File "/home/pokybuild/yocto-autobuilder/yocto-worker/nightly-mips/build/build/tmp/work/qemumips-poky-linux/core-image-sato/1.0-r0/testsdkext/layers/build/bitbake/lib/bb/parse/__init__.py", line 113, in handle
    return h['handle'](fn, data, include)
  File "/home/pokybuild/yocto-autobuilder/yocto-worker/nightly-mips/build/build/tmp/work/qemumips-poky-linux/core-image-sato/1.0-r0/testsdkext/layers/build/bitbake/lib/bb/parse/parse_py/BBHandler.py", line 157, in handle
    return ast.multi_finalize(fn, d)
  File "/home/pokybuild/yocto-autobuilder/yocto-worker/nightly-mips/build/build/tmp/work/qemumips-poky-linux/core-image-sato/1.0-r0/testsdkext/layers/build/bitbake/lib/bb/parse/ast.py", line 395, in multi_finalize
    finalize(fn, d)
  File "/home/pokybuild/yocto-autobuilder/yocto-worker/nightly-mips/build/build/tmp/work/qemumips-poky-linux/core-image-sato/1.0-r0/testsdkext/layers/build/bitbake/lib/bb/parse/ast.py", line 355, in finalize
    bb.utils.better_exec("\n".join(code), {"d": d})
  File "/home/pokybuild/yocto-autobuilder/yocto-worker/nightly-mips/build/build/tmp/work/qemumips-poky-linux/core-image-sato/1.0-r0/testsdkext/layers/build/bitbake/lib/bb/utils.py", line 399, in better_exec
    exec(code, get_context(), context)
  File "<code>", line 3, in <module>
  File "/home/pokybuild/yocto-autobuilder/yocto-worker/nightly-mips/build/build/tmp/work/qemumips-poky-linux/core-image-sato/1.0-r0/testsdkext/layers/build/meta/classes/base.bbclass", line 468, in __anon_686__home_pokybuild_yocto_autobuilder_yocto_worker_nightly_mips_build_build_tmp_work_qemumips_poky_linux_core_image_sato_1_0_r0_testsdkext_layers_build_meta_classes_base_bbclass
  File "/home/pokybuild/yocto-autobuilder/yocto-worker/nightly-mips/build/build/tmp/work/qemumips-poky-linux/core-image-sato/1.0-r0/testsdkext/layers/build/bitbake/lib/bb/__init__.py", line 104, in fatal
    raise BBHandledException()
bb.BBHandledException

ERROR: Parsing newly created recipe failed, moving recipe to /home/pokybuild/yocto-autobuilder/yocto-worker/nightly-mips/build/build/tmp/work/qemumips-poky-linux/core-image-sato/1.0-r0/testsdkext/workspace/recipes/myapp/myapp.bb.parsefailed for reference. If this looks to be caused by the recipe itself, please report this error.


======================================================================
ERROR [3.084s]: test_devtool_build_make (devtool.DevtoolTest)
----------------------------------------------------------------------
Traceback (most recent call last):
  File "/home/pokybuild/yocto-autobuilder/yocto-worker/nightly-mips/build/meta/lib/oeqa/core/decorator/__init__.py", line 32, in wrapped_f
    return func(*args, **kwargs)
  File "/home/pokybuild/yocto-autobuilder/yocto-worker/nightly-mips/build/meta/lib/oeqa/core/decorator/__init__.py", line 32, in wrapped_f
    return func(*args, **kwargs)
  File "/home/pokybuild/yocto-autobuilder/yocto-worker/nightly-mips/build/meta/lib/oeqa/sdkext/cases/devtool.py", line 56, in test_devtool_build_make
    self._test_devtool_build(self.myapp_dst)
  File "/home/pokybuild/yocto-autobuilder/yocto-worker/nightly-mips/build/meta/lib/oeqa/sdkext/cases/devtool.py", line 30, in _test_devtool_build
    self._run('devtool add myapp %s' % directory)
  File "/home/pokybuild/yocto-autobuilder/yocto-worker/nightly-mips/build/meta/lib/oeqa/sdkext/case.py", line 21, in _run
    shell=True, env=env, universal_newlines=True)
  File "/usr/lib/python3.5/subprocess.py", line 626, in check_output
    **kwargs).stdout
  File "/usr/lib/python3.5/subprocess.py", line 708, in run
    output=stdout, stderr=stderr)
oeqa.utils.subprocesstweak.OETestCalledProcessError: Command '. /home/pokybuild/yocto-autobuilder/yocto-worker/nightly-mips/build/build/tmp/work/qemumips-poky-linux/core-image-sato/1.0-r0/testsdkext/environment-setup-mips32r2-poky-linux > /dev/null; devtool add myapp /home/pokybuild/yocto-autobuilder/yocto-worker/nightly-mips/build/build/tmp/work/qemumips-poky-linux/core-image-sato/1.0-r0/testsdkext/myapp;' returned non-zero exit status 1
Standard Output: NOTE: Starting bitbake server...
NOTE: Starting bitbake server...
NOTE: Starting bitbake server...
ERROR: Traceback (most recent call last):
  File "/home/pokybuild/yocto-autobuilder/yocto-worker/nightly-mips/build/build/tmp/work/qemumips-poky-linux/core-image-sato/1.0-r0/testsdkext/layers/build/bitbake/lib/bb/command.py", line 83, in runCommand
    result = command_method(self, commandline)
  File "/home/pokybuild/yocto-autobuilder/yocto-worker/nightly-mips/build/build/tmp/work/qemumips-poky-linux/core-image-sato/1.0-r0/testsdkext/layers/build/bitbake/lib/bb/command.py", line 566, in parseRecipeFile
    envdata = parser.loadDataFull(fn, appendfiles)
  File "/home/pokybuild/yocto-autobuilder/yocto-worker/nightly-mips/build/build/tmp/work/qemumips-poky-linux/core-image-sato/1.0-r0/testsdkext/layers/build/bitbake/lib/bb/cache.py", line 339, in loadDataFull
    bb_data = self.load_bbfile(virtualfn, appends, virtonly=True)
  File "/home/pokybuild/yocto-autobuilder/yocto-worker/nightly-mips/build/build/tmp/work/qemumips-poky-linux/core-image-sato/1.0-r0/testsdkext/layers/build/bitbake/lib/bb/cache.py", line 352, in load_bbfile
    datastores = parse_recipe(bb_data, bbfile, appends, mc)
  File "/home/pokybuild/yocto-autobuilder/yocto-worker/nightly-mips/build/build/tmp/work/qemumips-poky-linux/core-image-sato/1.0-r0/testsdkext/layers/build/bitbake/lib/bb/cache.py", line 315, in parse_recipe
    bb_data = bb.parse.handle(bbfile, bb_data)
  File "/home/pokybuild/yocto-autobuilder/yocto-worker/nightly-mips/build/build/tmp/work/qemumips-poky-linux/core-image-sato/1.0-r0/testsdkext/layers/build/bitbake/lib/bb/parse/__init__.py", line 113, in handle
    return h['handle'](fn, data, include)
  File "/home/pokybuild/yocto-autobuilder/yocto-worker/nightly-mips/build/build/tmp/work/qemumips-poky-linux/core-image-sato/1.0-r0/testsdkext/layers/build/bitbake/lib/bb/parse/parse_py/BBHandler.py", line 157, in handle
    return ast.multi_finalize(fn, d)
  File "/home/pokybuild/yocto-autobuilder/yocto-worker/nightly-mips/build/build/tmp/work/qemumips-poky-linux/core-image-sato/1.0-r0/testsdkext/layers/build/bitbake/lib/bb/parse/ast.py", line 395, in multi_finalize
    finalize(fn, d)
  File "/home/pokybuild/yocto-autobuilder/yocto-worker/nightly-mips/build/build/tmp/work/qemumips-poky-linux/core-image-sato/1.0-r0/testsdkext/layers/build/bitbake/lib/bb/parse/ast.py", line 355, in finalize
    bb.utils.better_exec("\n".join(code), {"d": d})
  File "/home/pokybuild/yocto-autobuilder/yocto-worker/nightly-mips/build/build/tmp/work/qemumips-poky-linux/core-image-sato/1.0-r0/testsdkext/layers/build/bitbake/lib/bb/utils.py", line 399, in better_exec
    exec(code, get_context(), context)
  File "<code>", line 3, in <module>
  File "/home/pokybuild/yocto-autobuilder/yocto-worker/nightly-mips/build/build/tmp/work/qemumips-poky-linux/core-image-sato/1.0-r0/testsdkext/layers/build/meta/classes/base.bbclass", line 468, in __anon_686__home_pokybuild_yocto_autobuilder_yocto_worker_nightly_mips_build_build_tmp_work_qemumips_poky_linux_core_image_sato_1_0_r0_testsdkext_layers_build_meta_classes_base_bbclass
  File "/home/pokybuild/yocto-autobuilder/yocto-worker/nightly-mips/build/build/tmp/work/qemumips-poky-linux/core-image-sato/1.0-r0/testsdkext/layers/build/bitbake/lib/bb/__init__.py", line 104, in fatal
    raise BBHandledException()
bb.BBHandledException

ERROR: Parsing newly created recipe failed, moving recipe to /home/pokybuild/yocto-autobuilder/yocto-worker/nightly-mips/build/build/tmp/work/qemumips-poky-linux/core-image-sato/1.0-r0/testsdkext/workspace/recipes/myapp/myapp.bb.parsefailed for reference. If this looks to be caused by the recipe itself, please report this error.


======================================================================
ERROR [10.301s]: test_devtool_kernelmodule (devtool.DevtoolTest)
----------------------------------------------------------------------
Traceback (most recent call last):
  File "/home/pokybuild/yocto-autobuilder/yocto-worker/nightly-mips/build/meta/lib/oeqa/core/decorator/__init__.py", line 32, in wrapped_f
    return func(*args, **kwargs)
  File "/home/pokybuild/yocto-autobuilder/yocto-worker/nightly-mips/build/meta/lib/oeqa/core/decorator/__init__.py", line 32, in wrapped_f
    return func(*args, **kwargs)
  File "/home/pokybuild/yocto-autobuilder/yocto-worker/nightly-mips/build/meta/lib/oeqa/sdkext/cases/devtool.py", line 85, in test_devtool_kernelmodule
    self._run('devtool add %s %s' % (recipe, docfile) )
  File "/home/pokybuild/yocto-autobuilder/yocto-worker/nightly-mips/build/meta/lib/oeqa/sdkext/case.py", line 21, in _run
    shell=True, env=env, universal_newlines=True)
  File "/usr/lib/python3.5/subprocess.py", line 626, in check_output
    **kwargs).stdout
  File "/usr/lib/python3.5/subprocess.py", line 708, in run
    output=stdout, stderr=stderr)
oeqa.utils.subprocesstweak.OETestCalledProcessError: Command '. /home/pokybuild/yocto-autobuilder/yocto-worker/nightly-mips/build/build/tmp/work/qemumips-poky-linux/core-image-sato/1.0-r0/testsdkext/environment-setup-mips32r2-poky-linux > /dev/null; devtool add v4l2loopback-driver https://github.com/umlaeute/v4l2loopback.git;' returned non-zero exit status 1
Standard Output: NOTE: Starting bitbake server...
NOTE: Starting bitbake server...
NOTE: Fetching git://github.com/umlaeute/v4l2loopback.git;protocol=https...
NOTE: Starting bitbake server...
Loading cache...done.
Loaded 1258 entries from dependency cache.
Parsing recipes...done.
Parsing of 810 .bb files complete (809 cached, 1 parsed). 1259 targets, 69 skipped, 0 masked, 0 errors.
NOTE: Resolving any missing task queue dependencies
Initialising tasks...done.
NOTE: Executing RunQueue Tasks
NOTE: Tasks Summary: Attempted 2 tasks of which 0 didn't need to be rerun and all succeeded.
NOTE: Using default source tree path /home/pokybuild/yocto-autobuilder/yocto-worker/nightly-mips/build/build/tmp/work/qemumips-poky-linux/core-image-sato/1.0-r0/testsdkext/workspace/sources/v4l2loopback-driver
NOTE: Starting bitbake server...
ERROR: Traceback (most recent call last):
  File "/home/pokybuild/yocto-autobuilder/yocto-worker/nightly-mips/build/build/tmp/work/qemumips-poky-linux/core-image-sato/1.0-r0/testsdkext/layers/build/bitbake/lib/bb/command.py", line 83, in runCommand
    result = command_method(self, commandline)
  File "/home/pokybuild/yocto-autobuilder/yocto-worker/nightly-mips/build/build/tmp/work/qemumips-poky-linux/core-image-sato/1.0-r0/testsdkext/layers/build/bitbake/lib/bb/command.py", line 566, in parseRecipeFile
    envdata = parser.loadDataFull(fn, appendfiles)
  File "/home/pokybuild/yocto-autobuilder/yocto-worker/nightly-mips/build/build/tmp/work/qemumips-poky-linux/core-image-sato/1.0-r0/testsdkext/layers/build/bitbake/lib/bb/cache.py", line 339, in loadDataFull
    bb_data = self.load_bbfile(virtualfn, appends, virtonly=True)
  File "/home/pokybuild/yocto-autobuilder/yocto-worker/nightly-mips/build/build/tmp/work/qemumips-poky-linux/core-image-sato/1.0-r0/testsdkext/layers/build/bitbake/lib/bb/cache.py", line 352, in load_bbfile
    datastores = parse_recipe(bb_data, bbfile, appends, mc)
  File "/home/pokybuild/yocto-autobuilder/yocto-worker/nightly-mips/build/build/tmp/work/qemumips-poky-linux/core-image-sato/1.0-r0/testsdkext/layers/build/bitbake/lib/bb/cache.py", line 315, in parse_recipe
    bb_data = bb.parse.handle(bbfile, bb_data)
  File "/home/pokybuild/yocto-autobuilder/yocto-worker/nightly-mips/build/build/tmp/work/qemumips-poky-linux/core-image-sato/1.0-r0/testsdkext/layers/build/bitbake/lib/bb/parse/__init__.py", line 113, in handle
    return h['handle'](fn, data, include)
  File "/home/pokybuild/yocto-autobuilder/yocto-worker/nightly-mips/build/build/tmp/work/qemumips-poky-linux/core-image-sato/1.0-r0/testsdkext/layers/build/bitbake/lib/bb/parse/parse_py/BBHandler.py", line 157, in handle
    return ast.multi_finalize(fn, d)
  File "/home/pokybuild/yocto-autobuilder/yocto-worker/nightly-mips/build/build/tmp/work/qemumips-poky-linux/core-image-sato/1.0-r0/testsdkext/layers/build/bitbake/lib/bb/parse/ast.py", line 395, in multi_finalize
    finalize(fn, d)
  File "/home/pokybuild/yocto-autobuilder/yocto-worker/nightly-mips/build/build/tmp/work/qemumips-poky-linux/core-image-sato/1.0-r0/testsdkext/layers/build/bitbake/lib/bb/parse/ast.py", line 355, in finalize
    bb.utils.better_exec("\n".join(code), {"d": d})
  File "/home/pokybuild/yocto-autobuilder/yocto-worker/nightly-mips/build/build/tmp/work/qemumips-poky-linux/core-image-sato/1.0-r0/testsdkext/layers/build/bitbake/lib/bb/utils.py", line 399, in better_exec
    exec(code, get_context(), context)
  File "<code>", line 3, in <module>
  File "/home/pokybuild/yocto-autobuilder/yocto-worker/nightly-mips/build/build/tmp/work/qemumips-poky-linux/core-image-sato/1.0-r0/testsdkext/layers/build/meta/classes/base.bbclass", line 468, in __anon_686__home_pokybuild_yocto_autobuilder_yocto_worker_nightly_mips_build_build_tmp_work_qemumips_poky_linux_core_image_sato_1_0_r0_testsdkext_layers_build_meta_classes_base_bbclass
  File "/home/pokybuild/yocto-autobuilder/yocto-worker/nightly-mips/build/build/tmp/work/qemumips-poky-linux/core-image-sato/1.0-r0/testsdkext/layers/build/bitbake/lib/bb/__init__.py", line 104, in fatal
    raise BBHandledException()
bb.BBHandledException

ERROR: Parsing newly created recipe failed, moving recipe to /home/pokybuild/yocto-autobuilder/yocto-worker/nightly-mips/build/build/tmp/work/qemumips-poky-linux/core-image-sato/1.0-r0/testsdkext/workspace/recipes/v4l2loopback-driver/v4l2loopback-driver_git.bb.parsefailed for reference. If this looks to be caused by the recipe itself, please report this error.


======================================================================
ERROR [35.695s]: test_extend_autotools_recipe_creation (devtool.DevtoolTest)
----------------------------------------------------------------------
Traceback (most recent call last):
  File "/home/pokybuild/yocto-autobuilder/yocto-worker/nightly-mips/build/meta/lib/oeqa/core/decorator/__init__.py", line 32, in wrapped_f
    return func(*args, **kwargs)
  File "/home/pokybuild/yocto-autobuilder/yocto-worker/nightly-mips/build/meta/lib/oeqa/core/decorator/__init__.py", line 32, in wrapped_f
    return func(*args, **kwargs)
  File "/home/pokybuild/yocto-autobuilder/yocto-worker/nightly-mips/build/meta/lib/oeqa/sdkext/cases/devtool.py", line 74, in test_extend_autotools_recipe_creation
    self._run('devtool add %s %s' % (recipe, req) )
  File "/home/pokybuild/yocto-autobuilder/yocto-worker/nightly-mips/build/meta/lib/oeqa/sdkext/case.py", line 21, in _run
    shell=True, env=env, universal_newlines=True)
  File "/usr/lib/python3.5/subprocess.py", line 626, in check_output
    **kwargs).stdout
  File "/usr/lib/python3.5/subprocess.py", line 708, in run
    output=stdout, stderr=stderr)
oeqa.utils.subprocesstweak.OETestCalledProcessError: Command '. /home/pokybuild/yocto-autobuilder/yocto-worker/nightly-mips/build/build/tmp/work/qemumips-poky-linux/core-image-sato/1.0-r0/testsdkext/environment-setup-mips32r2-poky-linux > /dev/null; devtool add librdfa https://github.com/rdfa/librdfa;' returned non-zero exit status 1
Standard Output: NOTE: Starting bitbake server...
NOTE: Starting bitbake server...
NOTE: Fetching git://github.com/rdfa/librdfa;protocol=https...
NOTE: Starting bitbake server...
Loading cache...done.
Loaded 1258 entries from dependency cache.
Parsing recipes...done.
Parsing of 810 .bb files complete (809 cached, 1 parsed). 1259 targets, 69 skipped, 0 masked, 0 errors.
NOTE: Resolving any missing task queue dependencies
Initialising tasks...done.
NOTE: Executing RunQueue Tasks
NOTE: Tasks Summary: Attempted 2 tasks of which 0 didn't need to be rerun and all succeeded.
NOTE: Using default source tree path /home/pokybuild/yocto-autobuilder/yocto-worker/nightly-mips/build/build/tmp/work/qemumips-poky-linux/core-image-sato/1.0-r0/testsdkext/workspace/sources/librdfa
NOTE: Starting bitbake server...
ERROR: Traceback (most recent call last):
  File "/home/pokybuild/yocto-autobuilder/yocto-worker/nightly-mips/build/build/tmp/work/qemumips-poky-linux/core-image-sato/1.0-r0/testsdkext/layers/build/bitbake/lib/bb/command.py", line 83, in runCommand
    result = command_method(self, commandline)
  File "/home/pokybuild/yocto-autobuilder/yocto-worker/nightly-mips/build/build/tmp/work/qemumips-poky-linux/core-image-sato/1.0-r0/testsdkext/layers/build/bitbake/lib/bb/command.py", line 566, in parseRecipeFile
    envdata = parser.loadDataFull(fn, appendfiles)
  File "/home/pokybuild/yocto-autobuilder/yocto-worker/nightly-mips/build/build/tmp/work/qemumips-poky-linux/core-image-sato/1.0-r0/testsdkext/layers/build/bitbake/lib/bb/cache.py", line 339, in loadDataFull
    bb_data = self.load_bbfile(virtualfn, appends, virtonly=True)
  File "/home/pokybuild/yocto-autobuilder/yocto-worker/nightly-mips/build/build/tmp/work/qemumips-poky-linux/core-image-sato/1.0-r0/testsdkext/layers/build/bitbake/lib/bb/cache.py", line 352, in load_bbfile
    datastores = parse_recipe(bb_data, bbfile, appends, mc)
  File "/home/pokybuild/yocto-autobuilder/yocto-worker/nightly-mips/build/build/tmp/work/qemumips-poky-linux/core-image-sato/1.0-r0/testsdkext/layers/build/bitbake/lib/bb/cache.py", line 315, in parse_recipe
    bb_data = bb.parse.handle(bbfile, bb_data)
  File "/home/pokybuild/yocto-autobuilder/yocto-worker/nightly-mips/build/build/tmp/work/qemumips-poky-linux/core-image-sato/1.0-r0/testsdkext/layers/build/bitbake/lib/bb/parse/__init__.py", line 113, in handle
    return h['handle'](fn, data, include)
  File "/home/pokybuild/yocto-autobuilder/yocto-worker/nightly-mips/build/build/tmp/work/qemumips-poky-linux/core-image-sato/1.0-r0/testsdkext/layers/build/bitbake/lib/bb/parse/parse_py/BBHandler.py", line 157, in handle
    return ast.multi_finalize(fn, d)
  File "/home/pokybuild/yocto-autobuilder/yocto-worker/nightly-mips/build/build/tmp/work/qemumips-poky-linux/core-image-sato/1.0-r0/testsdkext/layers/build/bitbake/lib/bb/parse/ast.py", line 395, in multi_finalize
    finalize(fn, d)
  File "/home/pokybuild/yocto-autobuilder/yocto-worker/nightly-mips/build/build/tmp/work/qemumips-poky-linux/core-image-sato/1.0-r0/testsdkext/layers/build/bitbake/lib/bb/parse/ast.py", line 355, in finalize
    bb.utils.better_exec("\n".join(code), {"d": d})
  File "/home/pokybuild/yocto-autobuilder/yocto-worker/nightly-mips/build/build/tmp/work/qemumips-poky-linux/core-image-sato/1.0-r0/testsdkext/layers/build/bitbake/lib/bb/utils.py", line 399, in better_exec
    exec(code, get_context(), context)
  File "<code>", line 3, in <module>
  File "/home/pokybuild/yocto-autobuilder/yocto-worker/nightly-mips/build/build/tmp/work/qemumips-poky-linux/core-image-sato/1.0-r0/testsdkext/layers/build/meta/classes/base.bbclass", line 468, in __anon_686__home_pokybuild_yocto_autobuilder_yocto_worker_nightly_mips_build_build_tmp_work_qemumips_poky_linux_core_image_sato_1_0_r0_testsdkext_layers_build_meta_classes_base_bbclass
  File "/home/pokybuild/yocto-autobuilder/yocto-worker/nightly-mips/build/build/tmp/work/qemumips-poky-linux/core-image-sato/1.0-r0/testsdkext/layers/build/bitbake/lib/bb/__init__.py", line 104, in fatal
    raise BBHandledException()
bb.BBHandledException

ERROR: Parsing newly created recipe failed, moving recipe to /home/pokybuild/yocto-autobuilder/yocto-worker/nightly-mips/build/build/tmp/work/qemumips-poky-linux/core-image-sato/1.0-r0/testsdkext/workspace/recipes/librdfa/librdfa_git.bb.parsefailed for reference. If this looks to be caused by the recipe itself, please report this error.


----------------------------------------------------------------------
Ran 9 tests in 140.556s

FAILED (errors=6)

Generating XML reports...

RESULTS:
RESULTS - buildcpio.BuildCpioTest.test_cpio - Testcase -1: PASSED
RESULTS - buildgalculator.GalculatorTest.test_galculator - Testcase -1: SKIPPED
RESULTS - buildlzip.BuildLzipTest.test_lzip - Testcase -1: PASSED
RESULTS - gcc.GccCompileTest.test_gcc_compile - Testcase -1: PASSED
RESULTS - gcc.GccCompileTest.test_gpp2_compile - Testcase -1: PASSED
RESULTS - gcc.GccCompileTest.test_gpp_compile - Testcase -1: PASSED
RESULTS - gcc.GccCompileTest.test_make - Testcase -1: PASSED
RESULTS - perl.PerlTest.test_perl_exists - Testcase -1: SKIPPED
RESULTS - perl.PerlTest.test_perl_works - Testcase -1: SKIPPED
RESULTS - python.PythonTest.test_python_exists - Testcase -1: SKIPPED
RESULTS - python.PythonTest.test_python_stdout - Testcase -1: SKIPPED
RESULTS - python.PythonTest.test_python_testfile - Testcase -1: SKIPPED
RESULTS - devtool.DevtoolTest.test_devtool_add_reset - Testcase -1: ERROR
RESULTS - devtool.DevtoolTest.test_devtool_build_cmake - Testcase 1607: ERROR
RESULTS - devtool.DevtoolTest.test_devtool_build_esdk_package - Testcase 1606: ERROR
RESULTS - devtool.DevtoolTest.test_devtool_build_make - Testcase 1605: ERROR
RESULTS - devtool.DevtoolTest.test_devtool_kernelmodule - Testcase 1609: ERROR
RESULTS - devtool.DevtoolTest.test_devtool_location - Testcase -1: PASSED
RESULTS - devtool.DevtoolTest.test_extend_autotools_recipe_creation - Testcase 1608: ERROR
RESULTS - devtool.DevtoolTest.test_recipes_for_nodejs - Testcase 1610: PASSED
RESULTS - devtool.SdkUpdateTest.test_sdk_update_http - Testcase -1: PASSED
SUMMARY:
core-image-sato esdk (poky-glibc-x86_64-core-image-sato-mips32r2-toolchain-ext-2.3.sh:environment-setup-mips32r2-poky-linux) - Ran 21 tests in 140.595s
core-image-sato esdk - FAIL - Required tests failed
ERROR: core-image-sato-1.0-r0 do_testsdkext: core-image-sato - FAILED - check the task log and the commands log
ERROR: core-image-sato-1.0-r0 do_testsdkext: Function failed: do_testsdkext
ERROR: Logfile of failure stored in: /home/pokybuild/yocto-autobuilder/yocto-worker/nightly-mips/build/build/tmp/work/qemumips-poky-linux/core-image-sato/1.0-r0/temp/log.do_testsdkext.2846
NOTE: recipe core-image-sato-1.0-r0: task do_testsdkext: Failed
ERROR: Task (/home/pokybuild/yocto-autobuilder/yocto-worker/nightly-mips/build/meta/recipes-sato/images/core-image-sato.bb:do_testsdkext) failed with exit code '1'
NOTE: Tasks Summary: Attempted 2 tasks of which 0 didn't need to be rerun and 2 failed.
NOTE: The errors for this build are stored in /home/pokybuild/yocto-autobuilder/yocto-worker/nightly-mips/build/build/tmp/log/error-report/error_report_20170810012619.txt
You can send the errors to a reports server by running:
  send-error-report /home/pokybuild/yocto-autobuilder/yocto-worker/nightly-mips/build/build/tmp/log/error-report/error_report_20170810012619.txt [-s server]
NOTE: The contents of these logs will be posted in public if you use the above command with the default server. Please ensure you remove any identifying or proprietary information when prompted before sending.

Summary: 2 tasks failed:
  /home/pokybuild/yocto-autobuilder/yocto-worker/nightly-mips/build/meta/recipes-core/images/core-image-minimal.bb:do_testsdkext
  /home/pokybuild/yocto-autobuilder/yocto-worker/nightly-mips/build/meta/recipes-sato/images/core-image-sato.bb:do_testsdkext
Summary: There were 4 ERROR messages shown, returning a non-zero exit code.
program finished with exit code 1
elapsedTime=351.405311